program: Orca
programVersion: 5.0.2
elementType: N C C C C C C C C C C C C C C C C C C C C C H H H H H H H H H H H H H H H H H H H H H H H H H H
charge: 1
multiplicity: 1
keywords: wb97x-d3
keywords: def2-TZVPP
keywords: def2/J RIJCOSX
keywords: DEFGRID2
keywords: scfconv7
keywords: smallprint printgap noloewdin
keywords: NOSOSCF
formula: C21H26N
InChI: InChI=1/C21H26N/c1-21(2,3)15-8-5-9-16-22(4)17-19-13-10-12-18-11-6-7-14-20(18)19/h5-7,9-14,22H,16-17H2,1-4H3
48 atoms
N  2.337687 -1.241538 -0.322845
C  2.112415 -0.925834 1.139789
C  2.368539 0.517973 1.425706
C  1.458252 1.509764 0.957502
C  1.772603 2.875233 1.186645
C  -4.592113 -1.6406 -1.192805
C  1.731489 -2.566884 -0.731953
C  3.492624 0.885626 2.120885
C  0.254411 1.205125 0.277642
C  3.770355 -1.152211 -0.696557
C  2.945427 3.20835 1.901612
C  3.782844 2.238032 2.371628
C  0.899045 3.876673 0.708533
C  -5.067248 -2.205814 0.151074
C  -5.308066 -2.35308 -2.347752
C  -4.868571 -0.131236 -1.255966
C  0.251381 -2.557827 -0.56775
C  -0.571533 2.199143 -0.173568
C  -0.243894 3.550399 0.03416
C  -3.151678 -1.852073 -1.322472
C  -0.563052 -2.151565 -1.551148
C  -1.961113 -2.019132 -1.422946
H  2.777293 -1.578617 1.70601
H  1.086594 -1.212189 1.368549
H  2.019718 -2.726106 -1.771706
H  2.217681 -3.332009 -0.125805
H  4.170929 0.125158 2.490054
H  -0.065253 0.178939 0.138204
H  4.321035 -1.935017 -0.180021
H  4.160742 -0.179673 -0.411472
H  3.871575 -1.286015 -1.770315
H  3.169242 4.252561 2.08007
H  4.670314 2.500817 2.929787
H  1.146957 4.914892 0.889628
H  -4.875121 -3.276043 0.222665
H  -6.141265 -2.049954 0.257891
H  -4.571523 -1.713946 0.987946
H  -4.98598 -1.968159 -3.314831
H  -5.121675 -3.426409 -2.329163
H  -6.384165 -2.197097 -2.263581
H  -4.36837 0.399243 -0.445153
H  -4.536942 0.294527 -2.202868
H  -5.939985 0.049422 -1.162663
H  -0.167064 -2.873121 0.380064
H  -1.490984 1.940315 -0.681768
H  -0.904472 4.32631 -0.326877
H  -0.14068 -1.879458 -2.51732
H  1.834451 -0.519971 -0.846851
totalener: -870.41682383 hartree
nucrepener: 1686.96486961 hartree
electener: -2557.38169344 hartree
oneelecener: -4505.62074170 hartree
twoeener: 1948.23904826 hartree
kineticenergy: 866.24660435 hartree
xcener: -89.074602705596 hartree
chargesum: 1.0000000
charge: 0.161442 -0.193392 0.037289 -0.082361 -0.046357 -0.004116 -0.135324 -0.142910 -0.216864 -0.193920 -0.073341 -0.092617 -0.036785 -0.256240 -0.253250 -0.270160 -0.138866 -0.120849 -0.116986 -0.151353 -0.216931 0.217457 0.146463 0.183533 0.142549 0.147722 0.128601 0.152500 0.130386 0.156373 0.136953 0.130389 0.147761 0.128209 0.101467 0.099957 0.091844 0.098969 0.102402 0.098914 0.088875 0.100877 0.104826 0.135919 0.138359 0.145356 0.122752 0.164479
qa: 0.1614 -0.1934 0.0373 -0.0824 -0.0464 -0.0041 -0.1353 -0.1429 -0.2169 -0.1939 -0.0733 -0.0926 -0.0368 -0.2562 -0.2532 -0.2702 -0.1389 -0.1208 -0.1170 -0.1514 -0.2169 0.2175 0.1465 0.1835 0.1425 0.1477 0.1286 0.1525 0.1304 0.1564 0.1370 0.1304 0.1478 0.1282 0.1015 0.1000 0.0918 0.0990 0.1024 0.0989 0.0889 0.1009 0.1048 0.1359 0.1384 0.1454 0.1228 0.1645
va: 3.5754 3.8204 3.4173 4.0105 4.0272 4.1200 3.8684 3.9910 3.9426 3.8558 3.9884 3.9788 3.9230 3.8969 3.8958 3.9028 3.7805 4.0602 3.9905 3.9682 4.0634 3.6598 1.0086 0.9798 1.0013 1.0041 1.0082 1.0109 0.9978 0.9919 0.9986 1.0100 0.9979 1.0105 1.0073 1.0073 1.0075 1.0076 1.0074 1.0061 1.0074 1.0057 1.0091 1.0180 1.0026 0.9980 1.0024 1.0183
dispersion: -0.022236331 hartree
energy: -870.439060164732 hartree
dipole: -13.39600 16.05279 2.65679 -12.32084 11.17866 -1.14218 -6.53160 6.16056 -0.37104
magnitude: 2.91561 au
magnitude: 7.41088 debye
