program: Orca
programVersion: 5.0.2
elementType: N C C C C C C C C C C C C C C C C C C C C C H H H H H H H H H H H H H H H H H H H H H H H H H H
charge: 1
multiplicity: 1
keywords: wb97x-d3
keywords: def2-TZVPP
keywords: def2/J RIJCOSX
keywords: DEFGRID2
keywords: scfconv7
keywords: smallprint printgap noloewdin
keywords: NOSOSCF
formula: C21H26N
InChI: InChI=1/C21H26N/c1-21(2,3)15-8-5-9-16-22(4)17-19-13-10-12-18-11-6-7-14-20(18)19/h5-7,9-14,22H,16-17H2,1-4H3
48 atoms
N  2.289435 -1.316711 -0.105623
C  2.111938 -0.766672 1.293127
C  2.429857 0.691761 1.343703
C  1.542236 1.636494 0.750846
C  1.914316 3.006669 0.758777
C  -4.687076 -1.752289 -1.000451
C  1.612781 -2.657848 -0.294552
C  3.587971 1.114817 1.944941
C  0.306954 1.281249 0.156705
C  3.716622 -1.362053 -0.507385
C  3.120134 3.396947 1.384503
C  3.93604 2.476288 1.976382
C  1.064237 3.958959 0.154492
C  -5.334967 -2.035817 -2.360966
C  -4.929029 -0.289575 -0.600425
C  -5.267314 -2.689707 0.067314
C  0.134487 -2.546614 -0.158702
C  -0.496467 2.229178 -0.417958
C  -0.112293 3.58142 -0.429026
C  -3.245634 -1.978227 -1.090045
C  -0.657632 -2.341979 -1.220423
C  -2.054002 -2.159986 -1.143137
H  2.76639 -1.349784 1.941467
H  1.082752 -0.971117 1.585625
H  1.897154 -3.007404 -1.28768
H  2.053861 -3.333196 0.439702
H  4.248308 0.392645 2.411073
H  -0.051593 0.258399 0.178528
H  4.235975 -2.090142 0.111435
H  4.164192 -0.381333 -0.374885
H  3.787366 -1.657086 -1.551009
H  3.386434 4.446381 1.395922
H  4.84899 2.784705 2.465889
H  1.357593 5.001076 0.164803
H  -4.935461 -1.38399 -3.13746
H  -6.410119 -1.864194 -2.29803
H  -5.176883 -3.068748 -2.669771
H  -4.522763 0.39817 -1.342366
H  -6.000908 -0.103641 -0.523831
H  -4.47887 -0.059558 0.365216
H  -5.103025 -3.735569 -0.190378
H  -4.820862 -2.505678 1.044337
H  -6.342625 -2.529042 0.152754
H  -0.30401 -2.63428 0.827747
H  -1.440977 1.934587 -0.85566
H  -0.754796 4.319795 -0.888192
H  -0.219031 -2.302418 -2.216005
H  1.81139 -0.660958 -0.730219
totalener: -870.41697452 hartree
nucrepener: 1680.80379663 hartree
electener: -2551.22077114 hartree
oneelecener: -4493.33957630 hartree
twoeener: 1942.11880515 hartree
kineticenergy: 866.24075997 hartree
xcener: -89.072987892065 hartree
chargesum: 1.0000000
charge: 0.163445 -0.193431 0.046081 -0.083046 -0.047552 -0.007409 -0.130607 -0.149136 -0.222292 -0.193929 -0.073659 -0.092306 -0.035707 -0.252549 -0.269424 -0.253755 -0.157353 -0.120682 -0.116162 -0.160393 -0.189183 0.213378 0.146130 0.181832 0.139977 0.148322 0.129209 0.155900 0.130794 0.156191 0.136859 0.130713 0.147692 0.128612 0.096347 0.098810 0.101990 0.094678 0.103309 0.096958 0.102598 0.093803 0.099182 0.136179 0.137946 0.145387 0.121570 0.164679
qa: 0.1634 -0.1934 0.0461 -0.0830 -0.0476 -0.0074 -0.1306 -0.1491 -0.2223 -0.1939 -0.0737 -0.0923 -0.0357 -0.2525 -0.2694 -0.2538 -0.1574 -0.1207 -0.1162 -0.1604 -0.1892 0.2134 0.1461 0.1818 0.1400 0.1483 0.1292 0.1559 0.1308 0.1562 0.1369 0.1307 0.1477 0.1286 0.0963 0.0988 0.1020 0.0947 0.1033 0.0970 0.1026 0.0938 0.0992 0.1362 0.1379 0.1454 0.1216 0.1647
va: 3.5715 3.8228 3.4063 4.0025 4.0295 4.1253 3.8683 3.9922 3.9468 3.8550 3.9911 3.9780 3.9227 3.8948 3.9005 3.8933 3.7953 4.0604 3.9890 3.9772 4.0632 3.6689 1.0090 0.9805 1.0019 1.0033 1.0080 1.0062 0.9975 0.9924 0.9983 1.0099 0.9978 1.0103 1.0081 1.0065 1.0078 1.0072 1.0089 1.0068 1.0075 1.0082 1.0069 1.0186 1.0035 0.9979 1.0033 1.0178
dispersion: -0.021996581 hartree
energy: -870.438971098504 hartree
dipole: -14.09743 16.70632 2.60889 -13.31190 12.05203 -1.25987 -4.74029 4.57854 -0.16175
magnitude: 2.90168 au
magnitude: 7.37548 debye
