program: Orca
programVersion: 5.0.2
elementType: N C C C C C C C C C C C C C C C C C C C C C H H H H H H H H H H H H H H H H H H H H H H H H H H
charge: 1
multiplicity: 1
keywords: wb97x-d3
keywords: def2-TZVPP
keywords: def2/J RIJCOSX
keywords: DEFGRID2
keywords: scfconv7
keywords: smallprint printgap noloewdin
keywords: NOSOSCF
formula: C21H26N
InChI: InChI=1/C12H13N.C9H13/c1-13-9-11-7-4-6-10-5-2-3-8-12(10)11;1-5-6-7-8-9(2,3)4/h2-8,13H,9H2,1H3;5-6H,1H2,2-4H3
48 atoms
N  1.737356 -2.844818 1.694837
C  2.616646 -2.576787 0.563549
C  2.036513 -1.492494 -0.301257
C  1.989664 -0.145985 0.158297
C  1.349883 0.839783 -0.635796
C  -3.830429 1.077011 -1.752691
C  0.360685 0.092733 2.859486
C  1.492862 -1.794339 -1.524377
C  2.53272 0.252333 1.400598
C  2.336627 -3.737449 2.674743
C  0.816632 0.484579 -1.892438
C  0.89244 -0.807588 -2.329155
C  1.260697 2.173706 -0.154251
C  -4.754508 2.155847 -1.174025
C  -4.639674 -0.155118 -2.18368
C  -3.047961 1.637029 -2.95603
C  -0.621149 0.639058 2.068886
C  2.447313 1.562951 1.83104
C  1.801242 2.53485 1.045538
C  -2.851944 0.680422 -0.754131
C  -1.057297 -0.071594 0.961625
C  -2.020241 0.35348 0.067728
H  2.81081 -3.469568 -0.045702
H  3.591464 -2.271578 0.954125
H  0.687212 0.592514 3.761136
H  0.725659 -0.917827 2.688267
H  1.53264 -2.814247 -1.887055
H  3.062375 -0.463882 2.013426
H  1.612481 -3.964697 3.455212
H  3.186673 -3.246083 3.149863
H  2.693259 -4.685296 2.25548
H  0.350952 1.247012 -2.504115
H  0.4907 -1.081347 -3.295399
H  0.769916 2.914818 -0.773285
H  -5.312024 1.783406 -0.315341
H  -5.474493 2.462043 -1.933107
H  -4.195752 3.038036 -0.863488
H  -3.998375 -0.930273 -2.601762
H  -5.193608 -0.581778 -1.348292
H  -5.359672 0.13685 -2.948479
H  -3.757886 1.93454 -3.728208
H  -2.462496 2.514524 -2.6826
H  -2.380223 0.888948 -3.382569
H  -1.026565 1.61971 2.275912
H  2.914659 1.849287 2.764522
H  1.745134 3.558409 1.389191
H  -0.624266 -1.053075 0.783454
H  0.891109 -3.275215 1.341348
totalener: -870.35446128 hartree
nucrepener: 1766.85879421 hartree
electener: -2637.21325550 hartree
oneelecener: -4665.67343272 hartree
twoeener: 2028.46017722 hartree
kineticenergy: 866.24187669 hartree
xcener: -89.025159985340 hartree
chargesum: 1.0000000
charge: -0.309455 -0.087017 -0.063218 -0.019089 0.036403 -0.003911 -0.096397 -0.061682 -0.152486 -0.171597 -0.164782 -0.062044 -0.037227 -0.246009 -0.247649 -0.286946 -0.056449 -0.127109 -0.144080 -0.050178 -0.140239 0.254499 0.105891 0.117194 0.161931 0.164063 0.127201 0.158033 0.103550 0.093784 0.107261 0.123567 0.144531 0.126139 0.108005 0.105236 0.100630 0.101670 0.108541 0.105378 0.115727 0.106648 0.100959 0.150879 0.169906 0.148825 0.157119 0.123992
qa: -0.3095 -0.0870 -0.0632 -0.0191 0.0364 -0.0039 -0.0964 -0.0617 -0.1525 -0.1716 -0.1648 -0.0620 -0.0372 -0.2460 -0.2476 -0.2869 -0.0564 -0.1271 -0.1441 -0.0502 -0.1402 0.2545 0.1059 0.1172 0.1619 0.1641 0.1272 0.1580 0.1035 0.0938 0.1073 0.1236 0.1445 0.1261 0.1080 0.1052 0.1006 0.1017 0.1085 0.1054 0.1157 0.1066 0.1010 0.1509 0.1699 0.1488 0.1571 0.1240
va: 2.8769 3.8824 3.6895 3.6706 3.6785 4.1096 3.8026 3.9325 3.8447 3.9289 3.9468 3.9416 3.8878 3.8894 3.8894 3.9039 3.6710 3.9082 3.9447 3.8993 4.0231 3.6745 1.0053 0.9856 0.9929 1.0359 1.0087 1.0090 0.9984 0.9956 0.9948 1.0106 0.9967 1.0109 1.0059 1.0066 1.0071 1.0066 1.0061 1.0061 1.0097 1.0042 1.0055 1.0053 0.9899 0.9982 0.9896 1.0168
dispersion: -0.026628563 hartree
energy: -870.381089847964 hartree
dipole: -11.99374 11.25409 -0.73965 -4.00106 4.01952 0.01845 -1.20259 2.08034 0.87775
magnitude: 1.14798 au
magnitude: 2.91794 debye
