program: Orca
programVersion: 5.0.2
elementType: N C C C C C C C C C C C C C C C C C C C C C H H H H H H H H H H H H H H H H H H H H H H H H H H
charge: 1
multiplicity: 1
keywords: wb97x-d3
keywords: def2-TZVPP
keywords: def2/J RIJCOSX
keywords: DEFGRID2
keywords: scfconv7
keywords: smallprint printgap noloewdin
keywords: NOSOSCF
formula: C21H26N
InChI: InChI=1/C21H26N/c1-21(2,3)15-8-5-9-16-22(4)17-19-13-10-12-18-11-6-7-14-20(18)19/h5-7,9-14,22H,16-17H2,1-4H3
48 atoms
N  2.31746 -1.215196 -0.305194
C  2.142534 -0.876487 1.159115
C  2.434432 0.565997 1.415654
C  1.529384 1.567238 0.958001
C  1.877784 2.929948 1.151633
C  -4.66923 -1.73673 -1.183641
C  1.675838 -2.533584 -0.679224
C  3.586426 0.922893 2.069346
C  0.29853 1.274537 0.322698
C  3.740398 -1.159162 -0.72052
C  3.078703 3.251956 1.823683
C  3.910761 2.273473 2.28618
C  1.009579 3.940154 0.682452
C  -4.961637 -0.570819 -0.228765
C  -5.271454 -3.03336 -0.625113
C  -5.252476 -1.441299 -2.570708
C  0.198508 -2.493378 -0.497725
C  -0.522728 2.277014 -0.118128
C  -0.161607 3.624897 0.052929
C  -3.220638 -1.897956 -1.294613
C  -0.624819 -2.153763 -1.499081
C  -2.024563 -2.034444 -1.376177
H  2.81242 -1.5340 1.713818
H  1.119363 -1.14034 1.423922
H  1.944872 -2.719905 -1.719519
H  2.154612 -3.297479 -0.065215
H  4.261147 0.155471 2.430689
H  -0.044846 0.252369 0.210975
H  4.156442 -0.190633 -0.459326
H  3.809101 -1.308605 -1.794785
H  4.290647 -1.945581 -0.208989
H  3.328804 4.29447 1.975221
H  4.820179 2.528088 2.811916
H  1.284358 4.976233 0.834938
H  -4.555536 -0.757323 0.765268
H  -6.039848 -0.438453 -0.132023
H  -4.542293 0.364186 -0.600636
H  -4.871252 -3.266779 0.361144
H  -6.352701 -2.923949 -0.533409
H  -5.07427 -3.879821 -1.282196
H  -4.841131 -0.522698 -2.98901
H  -5.04958 -2.25281 -3.268905
H  -6.334214 -1.322959 -2.498323
H  -0.21256 -2.749457 0.470991
H  -1.464097 2.028233 -0.589644
H  -0.818573 4.407361 -0.300526
H  -0.210108 -1.945209 -2.483937
H  1.813425 -0.490654 -0.824361
totalener: -870.41704212 hartree
nucrepener: 1679.68857581 hartree
electener: -2550.10561793 hartree
oneelecener: -4491.11053327 hartree
twoeener: 1941.00491535 hartree
kineticenergy: 866.24427276 hartree
xcener: -89.073880696861 hartree
chargesum: 1.0000000
charge: 0.162116 -0.193284 0.042248 -0.084381 -0.045726 -0.016346 -0.130701 -0.145136 -0.221912 -0.194591 -0.074191 -0.092119 -0.038159 -0.263229 -0.252852 -0.251894 -0.154894 -0.122211 -0.114274 -0.159870 -0.196679 0.223467 0.146355 0.182477 0.140215 0.148281 0.128852 0.158205 0.156842 0.136841 0.130543 0.130556 0.147909 0.128320 0.098306 0.101789 0.091770 0.095903 0.099160 0.102886 0.093546 0.101422 0.099162 0.135842 0.137402 0.145404 0.121787 0.164844
qa: 0.1621 -0.1933 0.0422 -0.0844 -0.0457 -0.0163 -0.1307 -0.1451 -0.2219 -0.1946 -0.0742 -0.0921 -0.0382 -0.2632 -0.2529 -0.2519 -0.1549 -0.1222 -0.1143 -0.1599 -0.1967 0.2235 0.1464 0.1825 0.1402 0.1483 0.1289 0.1582 0.1568 0.1368 0.1305 0.1306 0.1479 0.1283 0.0983 0.1018 0.0918 0.0959 0.0992 0.1029 0.0935 0.1014 0.0992 0.1358 0.1374 0.1454 0.1218 0.1648
va: 3.5734 3.8234 3.4134 4.0023 4.0274 4.1339 3.8664 3.9923 3.9440 3.8558 3.9894 3.9779 3.9242 3.8993 3.8909 3.8949 3.7936 4.0612 3.9872 3.9787 4.0631 3.6584 1.0090 0.9801 1.0021 1.0035 1.0081 1.0051 0.9917 0.9985 0.9978 1.0099 0.9978 1.0104 1.0069 1.0081 1.0085 1.0083 1.0065 1.0075 1.0082 1.0081 1.0067 1.0186 1.0047 0.9977 1.0031 1.0183
dispersion: -0.021939869 hartree
energy: -870.438981986068 hartree
dipole: -13.94951 16.57754 2.62803 -12.97334 11.82962 -1.14371 -6.54204 6.17372 -0.36832
magnitude: 2.88969 au
magnitude: 7.34500 debye
