program: Orca
programVersion: 5.0.2
elementType: N C C C C C C C C C C C C C C C C C C C C C H H H H H H H H H H H H H H H H H H H H H H H H H H
charge: 1
multiplicity: 1
keywords: wb97x-d3
keywords: def2-TZVPP
keywords: def2/J RIJCOSX
keywords: DEFGRID2
keywords: scfconv7
keywords: smallprint printgap noloewdin
keywords: NOSOSCF
formula: C21H26N
InChI: InChI=1/C21H26N/c1-21(2,3)15-8-5-9-16-22(4)17-19-13-10-12-18-11-6-7-14-20(18)19/h5-7,9-14,22H,16-17H2,1-4H3
48 atoms
N  1.70141 -0.731089 -0.535462
C  3.055072 -0.364372 0.03214
C  2.948839 0.77348 0.993858
C  2.606692 2.074262 0.52463
C  2.415335 3.107381 1.479165
C  -5.21312 -2.751766 -1.3267
C  0.780088 -1.325685 0.507886
C  3.145438 0.55374 2.333589
C  2.445904 2.392884 -0.84559
C  1.826621 -1.60222 -1.728408
C  2.621093 2.833784 2.850444
C  2.994539 1.590223 3.271146
C  2.03336 4.394165 1.040392
C  -5.848381 -3.91441 -0.552749
C  -5.2794 -3.030235 -2.834984
C  -5.94428 -1.443204 -1.003322
C  -0.632624 -1.335858 0.049434
C  2.079743 3.651381 -1.240142
C  1.85646 4.661187 -0.287816
C  -3.810227 -2.631661 -0.931914
C  -1.298662 -2.466777 -0.215837
C  -2.653868 -2.530109 -0.603669
H  3.697657 -0.134592 -0.81927
H  3.449241 -1.262251 0.508161
H  1.156113 -2.327896 0.719352
H  0.902849 -0.714439 1.40219
H  3.422071 -0.4343 2.682883
H  2.668456 1.662833 -1.61704
H  2.350277 -2.513241 -1.447957
H  2.392128 -1.082482 -2.497627
H  0.837815 -1.849543 -2.103809
H  2.483895 3.63243 3.568526
H  3.162888 1.391993 4.320279
H  1.886624 5.174223 1.776793
H  -6.89507 -4.019701 -0.840979
H  -5.811903 -3.743587 0.522916
H  -5.343866 -4.856673 -0.764747
H  -6.321456 -3.121849 -3.14412
H  -4.82832 -2.221833 -3.410245
H  -4.769559 -3.958397 -3.091863
H  -5.909108 -1.220828 0.063084
H  -5.510333 -0.600584 -1.541487
H  -6.992031 -1.524532 -1.295291
H  -1.144915 -0.381159 -0.009284
H  1.976942 3.876846 -2.292944
H  1.564097 5.650224 -0.6118
H  -0.783595 -3.420377 -0.117525
H  1.26789 0.146408 -0.836075
totalener: -870.41771211 hartree
nucrepener: 1626.94131216 hartree
electener: -2497.35902427 hartree
oneelecener: -4385.78337761 hartree
twoeener: 1888.42435334 hartree
kineticenergy: 866.24123175 hartree
xcener: -89.072497837947 hartree
chargesum: 1.0000000
charge: 0.152409 -0.190586 0.102461 -0.111790 -0.054942 -0.019218 -0.128187 -0.128088 -0.252556 -0.189309 -0.074100 -0.096387 -0.033429 -0.254491 -0.257130 -0.256333 -0.182180 -0.105231 -0.113765 -0.139532 -0.178323 0.200291 0.173264 0.146224 0.131191 0.170487 0.129038 0.136907 0.132160 0.132006 0.156040 0.131180 0.147746 0.129526 0.097467 0.099859 0.098414 0.099183 0.095404 0.099450 0.099274 0.092453 0.098472 0.136775 0.142875 0.146916 0.119991 0.168115
qa: 0.1524 -0.1906 0.1025 -0.1118 -0.0549 -0.0192 -0.1282 -0.1281 -0.2526 -0.1893 -0.0741 -0.0964 -0.0334 -0.2545 -0.2571 -0.2563 -0.1822 -0.1052 -0.1138 -0.1395 -0.1783 0.2003 0.1733 0.1462 0.1312 0.1705 0.1290 0.1369 0.1322 0.1320 0.1560 0.1312 0.1477 0.1295 0.0975 0.0999 0.0984 0.0992 0.0954 0.0994 0.0993 0.0925 0.0985 0.1368 0.1429 0.1469 0.1200 0.1681
va: 3.5800 3.8217 3.3818 3.9831 4.0326 4.1320 3.8667 3.9691 3.9594 3.8564 3.9860 3.9838 3.9219 3.8969 3.8984 3.8970 3.8497 4.0479 3.9965 3.9650 4.0701 3.7333 0.9807 1.0060 1.0072 0.9939 1.0083 1.0107 0.9963 1.0010 0.9935 1.0095 0.9980 1.0098 1.0067 1.0075 1.0080 1.0068 1.0074 1.0076 1.0073 1.0085 1.0074 1.0187 1.0010 0.9973 1.0025 1.0143
dispersion: -0.020527359 hartree
energy: -870.438239473440 hartree
dipole: -20.12135 22.01387 1.89252 -17.03947 16.38721 -0.65226 -10.18247 9.65738 -0.52509
magnitude: 2.06949 au
magnitude: 5.26023 debye
