program: Orca
programVersion: 5.0.2
elementType: N C C C C C C C C C C C C C C C C C C C C C H H H H H H H H H H H H H H H H H H H H H H H H H H
charge: 1
multiplicity: 1
keywords: wb97x-d3
keywords: def2-TZVPP
keywords: def2/J RIJCOSX
keywords: DEFGRID2
keywords: scfconv7
keywords: smallprint printgap noloewdin
keywords: NOSOSCF
formula: C21H26N
InChI: InChI=1/C21H26N/c1-21(2,3)15-8-5-9-16-22(4)17-19-13-10-12-18-11-6-7-14-20(18)19/h5-7,9-14,22H,16-17H2,1-4H3
48 atoms
N  1.616118 -0.782304 -0.414638
C  2.976446 -0.399705 0.127403
C  2.912098 0.840746 0.956438
C  2.650331 2.098888 0.342398
C  2.510198 3.240092 1.175166
C  -5.254915 -2.918522 -1.145064
C  0.649689 -1.176093 0.68181
C  3.077497 0.758027 2.315901
C  2.523901 2.273852 -1.056717
C  1.72889 -1.825827 -1.462121
C  2.680722 3.106892 2.571817
C  2.972424 1.89694 3.132587
C  2.215547 4.492192 0.592019
C  -5.408611 -2.292276 -2.537893
C  -6.194712 -2.22199 -0.151011
C  -5.572402 -4.417535 -1.205506
C  -0.742972 -1.277041 0.175676
C  2.243009 3.501828 -1.592671
C  2.073821 4.62228 -0.760712
C  -3.87619 -2.73724 -0.693243
C  -1.404392 -2.439145 0.112449
C  -2.740607 -2.578564 -0.318628
H  3.633675 -0.2908 -0.736666
H  3.332319 -1.253586 0.704255
H  1.012271 -2.120579 1.090561
H  0.741348 -0.409039 1.450913
H  3.292754 -0.199835 2.775171
H  2.70464 1.450343 -1.739781
H  0.74094 -2.076808 -1.836716
H  2.19073 -2.710868 -1.030339
H  2.348275 -1.455023 -2.274839
H  2.583538 3.98637 3.195825
H  3.11506 1.805455 4.200104
H  2.108496 5.355534 1.236549
H  -6.435006 -2.417319 -2.884981
H  -4.748946 -2.768328 -3.263232
H  -5.186339 -1.225496 -2.521969
H  -5.988694 -1.153663 -0.088852
H  -7.228599 -2.347741 -0.475143
H  -6.10201 -2.6454 0.84876
H  -4.914552 -4.936263 -1.902557
H  -5.468285 -4.886215 -0.227153
H  -6.599995 -4.56396 -1.540759
H  -1.245171 -0.354841 -0.097423
H  2.165676 3.616094 -2.665476
H  1.849117 5.585894 -1.196367
H  -0.903076 -3.352517 0.426055
H  1.230279 0.059047 -0.851983
totalener: -870.41763520 hartree
nucrepener: 1624.14859257 hartree
electener: -2494.56622777 hartree
oneelecener: -4380.21179795 hartree
twoeener: 1885.64557018 hartree
kineticenergy: 866.24103434 hartree
xcener: -89.072476675600 hartree
chargesum: 1.0000000
charge: 0.155635 -0.191319 0.089502 -0.106844 -0.052358 -0.022315 -0.129902 -0.122074 -0.247111 -0.190806 -0.072892 -0.099020 -0.035771 -0.258062 -0.253338 -0.254379 -0.186624 -0.108505 -0.113304 -0.147793 -0.167427 0.204632 0.173950 0.147615 0.130363 0.172196 0.128055 0.134602 0.155840 0.131318 0.134296 0.131340 0.147867 0.129696 0.099939 0.097118 0.094308 0.095253 0.098522 0.101392 0.096020 0.099361 0.098068 0.136821 0.142539 0.147739 0.118893 0.166965
qa: 0.1556 -0.1913 0.0895 -0.1068 -0.0524 -0.0223 -0.1299 -0.1221 -0.2471 -0.1908 -0.0729 -0.0990 -0.0358 -0.2581 -0.2533 -0.2544 -0.1866 -0.1085 -0.1133 -0.1478 -0.1674 0.2046 0.1740 0.1476 0.1304 0.1722 0.1281 0.1346 0.1558 0.1313 0.1343 0.1313 0.1479 0.1297 0.0999 0.0971 0.0943 0.0953 0.0985 0.1014 0.0960 0.0994 0.0981 0.1368 0.1425 0.1477 0.1189 0.1670
va: 3.5786 3.8120 3.3857 3.9871 4.0316 4.1379 3.8624 3.9696 3.9654 3.8576 3.9850 3.9856 3.9226 3.8962 3.8938 3.8963 3.8642 4.0510 3.9950 3.9663 4.0703 3.7290 0.9808 1.0065 1.0073 0.9922 1.0085 1.0103 0.9929 0.9970 1.0004 1.0095 0.9980 1.0099 1.0072 1.0076 1.0081 1.0083 1.0065 1.0075 1.0082 1.0079 1.0067 1.0189 1.0010 0.9970 1.0032 1.0137
dispersion: -0.020500187 hartree
energy: -870.438135390947 hartree
dipole: -20.49414 22.32054 1.82640 -18.13508 17.44847 -0.68661 -8.81396 8.39975 -0.41420
magnitude: 1.99467 au
magnitude: 5.07006 debye
