program: Orca
programVersion: 5.0.2
elementType: N C C C C C C C C C C C C C C C C C C C C C H H H H H H H H H H H H H H H H H H H H H H H H H H
charge: 1
multiplicity: 1
keywords: wb97x-d3
keywords: def2-TZVPP
keywords: def2/J RIJCOSX
keywords: DEFGRID2
keywords: scfconv7
keywords: smallprint printgap noloewdin
keywords: NOSOSCF
formula: C21H26N
InChI: InChI=1/C21H26N/c1-21(2,3)15-8-5-9-16-22(4)17-19-13-10-12-18-11-6-7-14-20(18)19/h5-7,9-14,22H,16-17H2,1-4H3
48 atoms
N  1.102404 -0.5649 0.719157
C  2.341145 -0.173441 1.493622
C  3.135378 0.852202 0.753285
C  2.626736 2.174808 0.60469
C  3.359379 3.093558 -0.191597
C  -5.419268 -2.939605 -1.234178
C  0.12708 -1.351194 1.566816
C  4.333723 0.505803 0.183186
C  1.427219 2.623065 1.208977
C  1.432599 -1.266334 -0.54629
C  4.586311 2.69129 -0.766437
C  5.074436 1.43111 -0.572509
C  2.854955 4.398546 -0.38498
C  -5.593727 -1.834601 -2.284523
C  -6.483276 -2.786296 -0.13838
C  -5.53786 -4.318599 -1.895037
C  -1.213291 -1.431739 0.932485
C  0.96672 3.896371 1.006728
C  1.679243 4.79125 0.189854
C  -4.097786 -2.809369 -0.62303
C  -1.729646 -2.57509 0.464724
C  -3.009374 -2.688593 -0.117228
H  2.911737 -1.087291 1.65878
H  2.000856 0.184224 2.466473
H  0.571526 -2.333821 1.729984
H  0.080045 -0.837618 2.528963
H  4.72161 -0.497823 0.312534
H  0.877328 1.985822 1.893784
H  1.955399 -2.190436 -0.309331
H  2.068841 -0.631585 -1.155363
H  0.514012 -1.492254 -1.079379
H  5.141731 3.404075 -1.362863
H  6.020337 1.135507 -1.003955
H  3.42009 5.090857 -0.996072
H  -4.840432 -1.907551 -3.068781
H  -5.525319 -0.844134 -1.834977
H  -6.574836 -1.924674 -2.752052
H  -6.410093 -1.817777 0.355603
H  -7.476917 -2.864655 -0.581203
H  -6.390013 -3.563427 0.619681
H  -4.790144 -4.451688 -2.676648
H  -5.415435 -5.120266 -1.1673
H  -6.522809 -4.425413 -2.351073
H  -1.802535 -0.521551 0.894708
H  0.056057 4.222723 1.490607
H  1.303309 5.792926 0.034935
H  -1.147395 -3.49143 0.536581
H  0.637803 0.310383 0.460733
totalener: -870.41756857 hartree
nucrepener: 1613.65629172 hartree
electener: -2484.07386028 hartree
oneelecener: -4359.18166724 hartree
twoeener: 1875.10780696 hartree
kineticenergy: 866.24386145 hartree
xcener: -89.072799192791 hartree
chargesum: 1.0000000
charge: 0.166401 -0.190649 0.059997 -0.090846 -0.048460 -0.022448 -0.120763 -0.110558 -0.252185 -0.223710 -0.072930 -0.101775 -0.033936 -0.256762 -0.253591 -0.254034 -0.171642 -0.105785 -0.114559 -0.150076 -0.167079 0.206342 0.146944 0.169168 0.135984 0.143385 0.125733 0.138438 0.130007 0.159400 0.162569 0.131053 0.147886 0.129491 0.096837 0.094079 0.099204 0.095505 0.098632 0.101765 0.096428 0.099815 0.098165 0.130738 0.142380 0.147659 0.120410 0.167371
qa: 0.1664 -0.1906 0.0600 -0.0908 -0.0485 -0.0224 -0.1208 -0.1106 -0.2522 -0.2237 -0.0729 -0.1018 -0.0339 -0.2568 -0.2536 -0.2540 -0.1716 -0.1058 -0.1146 -0.1501 -0.1671 0.2063 0.1469 0.1692 0.1360 0.1434 0.1257 0.1384 0.1300 0.1594 0.1626 0.1311 0.1479 0.1295 0.0968 0.0941 0.0992 0.0955 0.0986 0.1018 0.0964 0.0998 0.0982 0.1307 0.1424 0.1477 0.1204 0.1674
va: 3.5516 3.8357 3.4180 3.9880 4.0267 4.1380 3.8733 3.9735 3.9623 3.8654 3.9829 3.9845 3.9235 3.8963 3.8941 3.8951 3.8479 4.0462 3.9976 3.9694 4.0764 3.7069 1.0094 0.9849 1.0053 1.0018 1.0092 1.0081 0.9989 0.9910 0.9932 1.0096 0.9981 1.0099 1.0076 1.0081 1.0077 1.0081 1.0065 1.0077 1.0078 1.0080 1.0069 1.0217 1.0011 0.9970 1.0027 1.0139
dispersion: -0.020456430 hartree
energy: -870.438024994959 hartree
dipole: -23.16805 24.54235 1.37430 -16.89911 16.41931 -0.47981 -5.06003 5.56864 0.50861
magnitude: 1.54195 au
magnitude: 3.91932 debye
