program: Orca
programVersion: 5.0.2
elementType: N C C C C C C C C C C C C C C C C C C C C C H H H H H H H H H H H H H H H H H H H H H H H H H H
charge: 1
multiplicity: 1
keywords: wb97x-d3
keywords: def2-TZVPP
keywords: def2/J RIJCOSX
keywords: DEFGRID2
keywords: scfconv7
keywords: smallprint printgap noloewdin
keywords: NOSOSCF
formula: C21H26N
InChI: InChI=1/C21H26N/c1-21(2,3)15-8-5-9-16-22(4)17-19-13-10-12-18-11-6-7-14-20(18)19/h5-7,9-14,22H,16-17H2,1-4H3
48 atoms
N  1.123676 -0.574791 0.522092
C  2.426232 -0.319012 1.248134
C  3.147497 0.850991 0.664184
C  2.624388 2.165574 0.832176
C  3.278954 3.240868 0.176173
C  -5.407391 -3.001641 -1.408192
C  0.235666 -1.536855 1.279239
C  4.289046 0.6510 -0.069078
C  1.483564 2.458017 1.618348
C  1.340107 -0.999724 -0.883519
C  4.448082 2.987558 -0.576719
C  4.954616 1.724568 -0.685972
C  2.757447 4.547699 0.297859
C  -6.41275 -2.340382 -0.456483
C  -5.745667 -4.48731 -1.582548
C  -5.431984 -2.293842 -2.770558
C  -1.140083 -1.581274 0.722299
C  1.003977 3.73621 1.719819
C  1.63953 4.792681 1.044471
C  -4.063451 -2.876906 -0.846319
C  -1.643617 -2.669691 0.127092
C  -2.952399 -2.764555 -0.39013
H  3.012195 -1.235186 1.174606
H  2.173324 -0.171313 2.299102
H  0.726815 -2.510334 1.247129
H  0.235215 -1.192813 2.315523
H  4.689121 -0.349965 -0.180879
H  0.99905 1.685176 2.206068
H  0.378579 -1.127156 -1.37122
H  1.87872 -1.944859 -0.885406
H  1.923007 -0.244492 -1.401652
H  4.945385 3.817089 -1.063355
H  5.858069 1.541563 -1.250303
H  3.263019 5.360281 -0.208423
H  -6.414241 -2.823892 0.520073
H  -7.417855 -2.419691 -0.872462
H  -6.19029 -1.283131 -0.313393
H  -5.046671 -4.97815 -2.259369
H  -5.723636 -5.014909 -0.629392
H  -6.747635 -4.590349 -2.001045
H  -4.722125 -2.742545 -3.465153
H  -6.427758 -2.374787 -3.208072
H  -5.192678 -1.23497 -2.673922
H  -1.763241 -0.702786 0.853302
H  0.140712 3.93981 2.338896
H  1.249715 5.797303 1.131086
H  -1.022258 -3.557735 0.031396
H  0.633633 0.323623 0.48911
totalener: -870.41764991 hartree
nucrepener: 1611.57359931 hartree
electener: -2481.99124923 hartree
oneelecener: -4355.02630671 hartree
twoeener: 1873.03505748 hartree
kineticenergy: 866.24144326 hartree
xcener: -89.072474312455 hartree
chargesum: 1.0000000
charge: 0.166932 -0.189890 0.060434 -0.087601 -0.048944 -0.023065 -0.122002 -0.110980 -0.257026 -0.224807 -0.073056 -0.101235 -0.032957 -0.253845 -0.253434 -0.257768 -0.175559 -0.103221 -0.115984 -0.151182 -0.159884 0.205722 0.146639 0.169994 0.135257 0.144714 0.125849 0.137405 0.161956 0.130274 0.161370 0.130644 0.147864 0.129150 0.101119 0.098785 0.092828 0.096946 0.099953 0.097875 0.099111 0.099354 0.094654 0.132172 0.142730 0.147240 0.118485 0.166983
qa: 0.1669 -0.1899 0.0604 -0.0876 -0.0489 -0.0231 -0.1220 -0.1110 -0.2570 -0.2248 -0.0731 -0.1012 -0.0330 -0.2538 -0.2534 -0.2578 -0.1756 -0.1032 -0.1160 -0.1512 -0.1599 0.2057 0.1466 0.1700 0.1353 0.1447 0.1258 0.1374 0.1620 0.1303 0.1614 0.1306 0.1479 0.1292 0.1011 0.0988 0.0928 0.0969 0.1000 0.0979 0.0991 0.0994 0.0947 0.1322 0.1427 0.1472 0.1185 0.1670
va: 3.5519 3.8343 3.4144 3.9839 4.0267 4.1376 3.8680 3.9731 3.9639 3.8658 3.9836 3.9845 3.9215 3.8938 3.8957 3.8975 3.8526 4.0439 3.9996 3.9728 4.0803 3.7090 1.0096 0.9840 1.0054 1.0010 1.0092 1.0093 0.9929 0.9990 0.9903 1.0098 0.9981 1.0099 1.0075 1.0070 1.0085 1.0082 1.0078 1.0066 1.0075 1.0072 1.0075 1.0210 1.0009 0.9971 1.0036 1.0137
dispersion: -0.020433782 hartree
energy: -870.438083696118 hartree
dipole: -23.11818 24.49786 1.37969 -17.02283 16.58507 -0.43776 -6.79801 7.09852 0.30051
magnitude: 1.47833 au
magnitude: 3.75763 debye
