program: Orca
programVersion: 5.0.2
elementType: N C C C C C C C C C C C C C C C C C C C C C H H H H H H H H H H H H H H H H H H H H H H H H H H
charge: 1
multiplicity: 1
keywords: wb97x-d3
keywords: def2-TZVPP
keywords: def2/J RIJCOSX
keywords: DEFGRID2
keywords: scfconv7
keywords: smallprint printgap noloewdin
keywords: NOSOSCF
formula: C21H26N
InChI: InChI=1/C21H26N/c1-21(2,3)15-8-5-9-16-22(4)17-19-13-10-12-18-11-6-7-14-20(18)19/h5-7,9-14,22H,16-17H2,1-4H3
48 atoms
N  2.200692 -1.164335 -0.509617
C  3.363832 -0.359127 0.022388
C  2.894569 0.751575 0.905473
C  2.128659 1.82408 0.3648
C  1.593821 2.788351 1.259044
C  -4.784134 -2.154841 -1.152966
C  1.396333 -1.843264 0.57923
C  3.161341 0.70562 2.250168
C  1.867142 1.979257 -1.018293
C  2.629546 -2.116906 -1.560478
C  1.887794 2.697056 2.638719
C  2.67206 1.691284 3.124899
C  0.78739 3.831225 0.752213
C  -5.034741 -1.268756 -2.381675
C  -5.769823 -1.790425 -0.034361
C  -4.939881 -3.63249 -1.532131
C  0.059515 -2.254629 0.068363
C  1.084328 3.003087 -1.479723
C  0.525283 3.932106 -0.584989
C  -3.422584 -1.921313 -0.674016
C  -1.005839 -1.453801 0.21103
C  -2.301055 -1.735016 -0.270771
H  3.914576 0.000202 -0.84897
H  4.011284 -1.053365 0.558289
H  1.997986 -2.680849 0.934999
H  1.301651 -1.119862 1.387555
H  3.755263 -0.106201 2.653563
H  2.333366 1.326886 -1.749679
H  3.319672 -2.83757 -1.128344
H  3.125859 -1.575566 -2.361908
H  1.762278 -2.634731 -1.96002
H  1.485989 3.44669 3.308794
H  2.907619 1.636976 4.178381
H  0.381623 4.559598 1.442964
H  -6.049373 -1.430177 -2.747679
H  -4.34423 -1.504116 -3.191367
H  -4.9291 -0.211716 -2.138542
H  -5.680314 -0.742132 0.249451
H  -6.79202 -1.96192 -0.373838
H  -5.604578 -2.398537 0.854614
H  -5.954038 -3.817459 -1.88829
H  -4.24832 -3.914879 -2.325778
H  -4.760353 -4.283303 -0.676669
H  -0.044042 -3.215956 -0.41951
H  0.908076 3.110184 -2.541514
H  -0.093339 4.735012 -0.961067
H  -0.888156 -0.507562 0.737398
H  1.554394 -0.497417 -0.941463
totalener: -870.41663561 hartree
nucrepener: 1668.90002164 hartree
electener: -2539.31665725 hartree
oneelecener: -4469.58343456 hartree
twoeener: 1930.26677731 hartree
kineticenergy: 866.24085990 hartree
xcener: -89.071919102629 hartree
chargesum: 1.0000000
charge: 0.154868 -0.193970 0.126750 -0.131575 -0.062010 -0.018085 -0.166866 -0.122234 -0.248109 -0.172482 -0.070218 -0.101033 -0.032610 -0.256736 -0.254939 -0.254867 -0.163785 -0.095814 -0.115806 -0.143233 -0.175839 0.204725 0.172230 0.144247 0.150225 0.165181 0.126581 0.134704 0.132831 0.131049 0.140770 0.131766 0.148652 0.129778 0.099872 0.095288 0.097763 0.097179 0.097849 0.100634 0.098529 0.092732 0.099699 0.136165 0.142664 0.147715 0.119801 0.159964
qa: 0.1549 -0.1940 0.1267 -0.1316 -0.0620 -0.0181 -0.1669 -0.1222 -0.2481 -0.1725 -0.0702 -0.1010 -0.0326 -0.2567 -0.2549 -0.2549 -0.1638 -0.0958 -0.1158 -0.1432 -0.1758 0.2047 0.1722 0.1442 0.1502 0.1652 0.1266 0.1347 0.1328 0.1310 0.1408 0.1318 0.1487 0.1298 0.0999 0.0953 0.0978 0.0972 0.0978 0.1006 0.0985 0.0927 0.0997 0.1362 0.1427 0.1477 0.1198 0.1600
va: 3.5720 3.8269 3.3504 3.9594 4.0150 4.1313 3.9014 3.9718 3.9534 3.8520 3.9805 3.9839 3.9201 3.8978 3.8972 3.8975 3.7819 4.0354 3.9966 3.9738 4.0603 3.7188 0.9805 1.0086 1.0072 0.9977 1.0097 1.0102 0.9963 0.9998 0.9994 1.0093 0.9977 1.0098 1.0070 1.0075 1.0075 1.0080 1.0066 1.0075 1.0074 1.0085 1.0073 1.0129 1.0008 0.9970 1.0026 1.0337
dispersion: -0.021316519 hartree
energy: -870.437952130978 hartree
dipole: -15.55249 17.93258 2.38009 -16.42261 15.35056 -1.07205 -9.39420 8.86283 -0.53137
magnitude: 2.66392 au
magnitude: 6.77116 debye
