program: Orca
programVersion: 5.0.2
elementType: N C C C C C C C C C C C C C C C C C C C C C H H H H H H H H H H H H H H H H H H H H H H H H H H
charge: 1
multiplicity: 1
keywords: wb97x-d3
keywords: def2-TZVPP
keywords: def2/J RIJCOSX
keywords: DEFGRID2
keywords: scfconv7
keywords: smallprint printgap noloewdin
keywords: NOSOSCF
formula: C21H26N
InChI: InChI=1/C21H26N/c1-21(2,3)15-8-5-9-16-22(4)17-19-13-10-12-18-11-6-7-14-20(18)19/h5-7,9-14,22H,16-17H2,1-4H3
48 atoms
N  2.173417 -1.170264 -0.4955
C  3.346685 -0.391946 0.054018
C  2.888767 0.739244 0.916591
C  2.178563 1.834074 0.345074
C  1.660749 2.829572 1.214647
C  -4.830619 -2.171172 -1.114229
C  1.362832 -1.855091 0.584387
C  3.115524 0.696077 2.268693
C  1.956755 1.981981 -1.045631
C  2.590965 -2.110368 -1.56202
C  1.912675 2.740888 2.60265
C  2.639483 1.708024 3.120437
C  0.912621 3.899407 0.675667
C  -4.794319 -2.490269 -2.614732
C  -5.664835 -0.908579 -0.866014
C  -5.427145 -3.355253 -0.340749
C  0.027695 -2.265903 0.069649
C  1.229369 3.031786 -1.538278
C  0.688506 3.994764 -0.66873
C  -3.465468 -1.9443 -0.642483
C  -1.043753 -1.47635 0.228327
C  -2.340667 -1.762614 -0.245799
H  3.926207 -0.054501 -0.807217
H  3.963323 -1.098826 0.609394
H  1.963445 -2.69505 0.93664
H  1.266493 -1.136211 1.396688
H  3.667537 -0.133027 2.695851
H  2.41074 1.300434 -1.75776
H  3.276851 -2.843037 -1.143532
H  3.089143 -1.560237 -2.356314
H  1.718273 -2.614533 -1.967062
H  1.524251 3.513557 3.254137
H  2.841804 1.654721 4.180815
H  0.520285 4.652266 1.347616
H  -5.808157 -2.662681 -2.977895
H  -4.207572 -3.385897 -2.81771
H  -4.368901 -1.665944 -3.186997
H  -5.258312 -0.051263 -1.402333
H  -6.687179 -1.067211 -1.211401
H  -5.703395 -0.659449 0.194176
H  -6.447435 -3.537219 -0.680487
H  -4.850686 -4.26628 -0.499497
H  -5.459786 -3.155397 0.729934
H  -0.071656 -3.222254 -0.428689
H  1.082919 3.131839 -2.60523
H  0.113583 4.817942 -1.069435
H  -0.930436 -0.53512 0.764063
H  1.537602 -0.486856 -0.916995
totalener: -870.41687722 hartree
nucrepener: 1664.73416806 hartree
electener: -2535.15104529 hartree
oneelecener: -4461.26396614 hartree
twoeener: 1926.11292085 hartree
kineticenergy: 866.24234308 hartree
xcener: -89.072165394763 hartree
chargesum: 1.0000000
charge: 0.154313 -0.191908 0.127486 -0.129873 -0.062599 -0.020006 -0.164554 -0.127778 -0.246157 -0.171997 -0.070959 -0.099147 -0.032689 -0.256697 -0.255592 -0.252987 -0.168495 -0.098892 -0.115522 -0.147909 -0.169242 0.207562 0.171615 0.145068 0.149897 0.163526 0.127140 0.134959 0.133222 0.130558 0.140764 0.131887 0.148669 0.129861 0.099953 0.095713 0.095688 0.094372 0.098360 0.099192 0.098299 0.096820 0.101115 0.136176 0.142520 0.147614 0.119322 0.161332
qa: 0.1543 -0.1919 0.1275 -0.1299 -0.0626 -0.0200 -0.1646 -0.1278 -0.2462 -0.1720 -0.0710 -0.0991 -0.0327 -0.2567 -0.2556 -0.2530 -0.1685 -0.0989 -0.1155 -0.1479 -0.1692 0.2076 0.1716 0.1451 0.1499 0.1635 0.1271 0.1350 0.1332 0.1306 0.1408 0.1319 0.1487 0.1299 0.1000 0.0957 0.0957 0.0944 0.0984 0.0992 0.0983 0.0968 0.1011 0.1362 0.1425 0.1476 0.1193 0.1613
va: 3.5731 3.8242 3.3457 3.9683 4.0207 4.1372 3.8989 3.9710 3.9545 3.8522 3.9818 3.9827 3.9205 3.8961 3.8967 3.8944 3.7893 4.0406 3.9965 3.9746 4.0609 3.7174 0.9808 1.0083 1.0072 0.9990 1.0096 1.0104 0.9960 1.0002 0.9995 1.0093 0.9977 1.0098 1.0074 1.0082 1.0075 1.0082 1.0069 1.0079 1.0065 1.0083 1.0075 1.0128 1.0009 0.9970 1.0028 1.0308
dispersion: -0.021166602 hartree
energy: -870.438043825736 hartree
dipole: -15.89638 18.24182 2.34543 -16.53715 15.45525 -1.08189 -9.16915 8.64936 -0.51980
magnitude: 2.63472 au
magnitude: 6.69692 debye
