program: Orca
programVersion: 5.0.2
elementType: N C C C C C C C C C C C C C C C C C C C C C H H H H H H H H H H H H H H H H H H H H H H H H H H
charge: 1
multiplicity: 1
keywords: wb97x-d3
keywords: def2-TZVPP
keywords: def2/J RIJCOSX
keywords: DEFGRID2
keywords: scfconv7
keywords: smallprint printgap noloewdin
keywords: NOSOSCF
formula: C21H26N
InChI: InChI=1/C21H26N/c1-21(2,3)15-8-5-9-16-22(4)17-19-13-10-12-18-11-6-7-14-20(18)19/h5-7,9-14,22H,16-17H2,1-4H3
48 atoms
N  2.152461 -1.130993 -0.525273
C  3.321532 -0.364123 0.049653
C  2.858691 0.75315 0.927537
C  2.176278 1.870497 0.365765
C  1.666291 2.861115 1.245713
C  -4.850639 -2.288539 -1.11341
C  1.346046 -1.848809 0.535818
C  3.061397 0.679914 2.282321
C  1.977406 2.047312 -1.024924
C  2.577726 -2.041107 -1.614518
C  1.892604 2.740986 2.635661
C  2.589128 1.68365 3.14572
C  0.952423 3.958282 0.71529
C  -5.072527 -1.520046 -2.423796
C  -5.839799 -1.800122 -0.047291
C  -5.032536 -3.792691 -1.349768
C  0.019298 -2.271383 0.010244
C  1.282655 3.122904 -1.509021
C  0.752455 4.083639 -0.63037
C  -3.488105 -2.034531 -0.648304
C  -1.071899 -1.519486 0.210429
C  -2.364803 -1.824556 -0.262597
H  3.910135 -0.0120 -0.799334
H  3.931379 -1.082322 0.598029
H  1.958153 -2.686669 0.873748
H  1.236051 -1.147575 1.361658
H  3.594389 -0.165461 2.701876
H  2.42227 1.365848 -1.742766
H  1.708238 -2.532475 -2.04152
H  3.259051 -2.786373 -1.210901
H  3.083758 -1.469405 -2.388391
H  1.508661 3.50893 3.295354
H  2.771073 1.605523 4.208286
H  0.567435 4.707884 1.395102
H  -4.945549 -0.44687 -2.282825
H  -6.087645 -1.694966 -2.782492
H  -4.381027 -1.847106 -3.200127
H  -5.696671 -2.324166 0.897411
H  -5.731423 -0.731505 0.13673
H  -6.861911 -1.98287 -0.381379
H  -4.342587 -4.162975 -2.107888
H  -4.870517 -4.361949 -0.434718
H  -6.048268 -3.991854 -1.693592
H  -0.058622 -3.209322 -0.52577
H  1.153396 3.244515 -2.575974
H  0.205252 4.928517 -1.024739
H  -0.97993 -0.598668 0.784159
H  1.514997 -0.439035 -0.930045
totalener: -870.41709438 hartree
nucrepener: 1660.44198772 hartree
electener: -2530.85908210 hartree
oneelecener: -4452.70014050 hartree
twoeener: 1921.84105840 hartree
kineticenergy: 866.24351255 hartree
xcener: -89.072289543587 hartree
chargesum: 1.0000000
charge: 0.154918 -0.191981 0.125128 -0.127631 -0.061162 -0.019785 -0.161521 -0.129588 -0.242878 -0.172655 -0.072320 -0.099115 -0.032500 -0.257151 -0.254990 -0.254046 -0.171640 -0.101387 -0.114907 -0.145911 -0.164003 0.203442 0.171573 0.146315 0.149915 0.161195 0.127842 0.133406 0.140322 0.133582 0.130781 0.131650 0.148518 0.129654 0.097897 0.099919 0.095309 0.100382 0.096520 0.097935 0.092882 0.099978 0.098784 0.136138 0.142179 0.147370 0.118910 0.162727
qa: 0.1549 -0.1920 0.1251 -0.1276 -0.0612 -0.0198 -0.1615 -0.1296 -0.2429 -0.1727 -0.0723 -0.0991 -0.0325 -0.2572 -0.2550 -0.2540 -0.1716 -0.1014 -0.1149 -0.1459 -0.1640 0.2034 0.1716 0.1463 0.1499 0.1612 0.1278 0.1334 0.1403 0.1336 0.1308 0.1316 0.1485 0.1297 0.0979 0.0999 0.0953 0.1004 0.0965 0.0979 0.0929 0.1000 0.0988 0.1361 0.1422 0.1474 0.1189 0.1627
va: 3.5742 3.8208 3.3410 3.9763 4.0248 4.1344 3.8961 3.9687 3.9583 3.8531 3.9825 3.9837 3.9203 3.8978 3.8964 3.8963 3.7953 4.0441 3.9956 3.9795 4.0662 3.7189 0.9810 1.0081 1.0066 1.0010 1.0093 1.0108 0.9997 0.9957 1.0004 1.0094 0.9978 1.0098 1.0074 1.0070 1.0076 1.0076 1.0081 1.0067 1.0087 1.0075 1.0071 1.0126 1.0010 0.9971 1.0029 1.0274
dispersion: -0.021030005 hartree
energy: -870.438124387911 hartree
dipole: -15.92756 18.26354 2.33598 -16.82599 15.80295 -1.02304 -9.32218 8.76763 -0.55455
magnitude: 2.60977 au
magnitude: 6.63352 debye
