program: Orca
programVersion: 5.0.2
elementType: N C C C C C C C C C C C C C C C C C C C C C H H H H H H H H H H H H H H H H H H H H H H H H H H
charge: 1
multiplicity: 1
keywords: wb97x-d3
keywords: def2-TZVPP
keywords: def2/J RIJCOSX
keywords: DEFGRID2
keywords: scfconv7
keywords: smallprint printgap noloewdin
keywords: NOSOSCF
formula: C21H26N
InChI: InChI=1/C21H26N/c1-21(2,3)15-8-5-9-16-22(4)17-19-13-10-12-18-11-6-7-14-20(18)19/h5-7,9-14,22H,16-17H2,1-4H3
48 atoms
N  2.135028 -1.024881 -0.64711
C  3.31868 -0.304219 -0.04324
C  2.883687 0.725882 0.947662
C  2.173384 1.882491 0.515586
C  1.69224 2.785718 1.499533
C  -4.833025 -2.284128 -1.286198
C  1.35156 -1.821347 0.37443
C  3.141701 0.534091 2.281324
C  1.91998 2.181191 -0.845138
C  2.535441 -1.849575 -1.811875
C  1.975509 2.544806 2.863323
C  2.69971 1.453619 3.248367
C  0.949872 3.918199 1.097999
C  -5.798726 -1.240167 -0.712198
C  -5.250343 -3.690227 -0.834614
C  -4.827388 -2.207667 -2.819466
C  0.0239 -2.227531 -0.161956
C  1.19973 3.28889 -1.203301
C  0.697082 4.161682 -0.222524
C  -3.48264 -2.013404 -0.795957
C  -1.074682 -1.502443 0.090007
C  -2.365208 -1.7999 -0.394561
H  3.877469 0.1261 -0.876341
H  3.948873 -1.065494 0.417056
H  1.978301 -2.671407 0.64933
H  1.245078 -1.176946 1.245658
H  3.695168 -0.340694 2.602517
H  2.342606 1.572425 -1.637826
H  1.656792 -2.309849 -2.254314
H  3.227426 -2.620598 -1.481132
H  3.022918 -1.220196 -2.55236
H  1.614346 3.247259 3.603863
H  2.925988 1.283991 4.291662
H  0.586774 4.599568 1.856975
H  -6.809712 -1.436402 -1.071321
H  -5.523104 -0.231214 -1.018505
H  -5.816946 -1.27193 0.376959
H  -5.256787 -3.773888 0.25188
H  -6.256776 -3.906941 -1.194761
H  -4.579155 -4.451958 -1.23077
H  -4.528019 -1.219435 -3.168419
H  -4.149938 -2.943267 -3.252618
H  -5.829703 -2.408818 -3.199614
H  -0.048462 -3.133183 -0.751549
H  1.02929 3.504645 -2.249436
H  0.128704 5.032386 -0.518489
H  -0.99102 -0.617088 0.718126
H  1.489416 -0.30492 -0.984209
totalener: -870.41715545 hartree
nucrepener: 1659.27585990 hartree
electener: -2529.69301535 hartree
oneelecener: -4450.36932304 hartree
twoeener: 1920.67630769 hartree
kineticenergy: 866.23948572 hartree
xcener: -89.071632144112 hartree
chargesum: 1.0000000
charge: 0.155856 -0.193285 0.118930 -0.126700 -0.059852 -0.020149 -0.162571 -0.122350 -0.245843 -0.173798 -0.071323 -0.100645 -0.032791 -0.255517 -0.253674 -0.257421 -0.172148 -0.101112 -0.115084 -0.150781 -0.162467 0.206043 0.172475 0.146437 0.149444 0.162823 0.127225 0.134317 0.140650 0.133265 0.131471 0.131186 0.148063 0.129726 0.098391 0.095334 0.099528 0.101345 0.098789 0.095358 0.096619 0.094900 0.100352 0.136209 0.142019 0.147882 0.120149 0.162722
qa: 0.1559 -0.1933 0.1189 -0.1267 -0.0599 -0.0201 -0.1626 -0.1223 -0.2458 -0.1738 -0.0713 -0.1006 -0.0328 -0.2555 -0.2537 -0.2574 -0.1721 -0.1011 -0.1151 -0.1508 -0.1625 0.2060 0.1725 0.1464 0.1494 0.1628 0.1272 0.1343 0.1407 0.1333 0.1315 0.1312 0.1481 0.1297 0.0984 0.0953 0.0995 0.1013 0.0988 0.0954 0.0966 0.0949 0.1004 0.1362 0.1420 0.1479 0.1201 0.1627
va: 3.5744 3.8164 3.3471 3.9740 4.0240 4.1376 3.8946 3.9695 3.9599 3.8530 3.9818 3.9851 3.9203 3.8955 3.8939 3.8965 3.7985 4.0438 3.9966 3.9783 4.0641 3.7156 0.9808 1.0081 1.0067 1.0001 1.0096 1.0102 0.9997 0.9957 1.0000 1.0096 0.9980 1.0099 1.0068 1.0081 1.0079 1.0075 1.0066 1.0085 1.0076 1.0081 1.0071 1.0124 1.0011 0.9970 1.0026 1.0280
dispersion: -0.021025816 hartree
energy: -870.438181270172 hartree
dipole: -15.94832 18.26718 2.31886 -16.49873 15.55867 -0.94006 -10.79837 10.12520 -0.67317
magnitude: 2.59114 au
magnitude: 6.58615 debye
