program: Orca
programVersion: 5.0.2
elementType: N C C C C C C C C C C C C C C C C C C C C C H H H H H H H H H H H H H H H H H H H H H H H H H H
charge: 1
multiplicity: 1
keywords: wb97x-d3
keywords: def2-TZVPP
keywords: def2/J RIJCOSX
keywords: DEFGRID2
keywords: scfconv7
keywords: smallprint printgap noloewdin
keywords: NOSOSCF
formula: C21H26N
InChI: InChI=1/C21H26N/c1-21(2,3)15-8-5-9-16-22(4)17-19-13-10-12-18-11-6-7-14-20(18)19/h5-7,9-14,22H,16-17H2,1-4H3
48 atoms
N  2.111741 -1.066193 -0.572793
C  3.304394 -0.33523 -0.000088
C  2.884281 0.751837 0.934644
C  2.199252 1.898602 0.440111
C  1.734469 2.861278 1.37431
C  -4.858486 -2.351379 -1.225639
C  1.305491 -1.789698 0.484437
C  3.133456 0.62394 2.277458
C  1.955452 2.131321 -0.935043
C  2.506759 -1.961242 -1.686058
C  2.007926 2.685389 2.749874
C  2.70667 1.600227 3.194284
C  1.017749 3.98687 0.911685
C  -5.604222 -1.034263 -1.476403
C  -5.589945 -3.17033 -0.15252
C  -4.762994 -3.158492 -2.526394
C  -0.015118 -2.222925 -0.047068
C  1.258937 3.233196 -1.352897
C  0.772971 4.166273 -0.420449
C  -3.511077 -2.053195 -0.743095
C  -1.117759 -1.486878 0.149011
C  -2.400417 -1.815116 -0.336944
H  3.873372 0.043243 -0.8512
H  3.920198 -1.082061 0.501441
H  1.92184 -2.623999 0.823727
H  1.189235 -1.090196 1.31092
H  3.667448 -0.244426 2.645546
H  2.366667 1.473286 -1.693631
H  3.169086 -2.734154 -1.303185
H  3.025324 -1.385096 -2.448186
H  1.622543 -2.418185 -2.120641
H  1.659657 3.43302 3.451313
H  2.925725 1.479803 4.245845
H  0.667543 4.714536 1.632816
H  -6.613726 -1.244758 -1.8314
H  -5.102106 -0.429761 -2.231577
H  -5.684645 -0.442809 -0.564707
H  -5.667115 -2.619787 0.784614
H  -6.600381 -3.399554 -0.493382
H  -5.079889 -4.112422 0.047067
H  -5.764524 -3.390105 -2.890738
H  -4.244323 -2.599117 -3.304848
H  -4.235458 -4.099674 -2.372814
H  -0.080122 -3.159878 -0.586525
H  1.094774 3.3973 -2.409311
H  0.223519 5.031969 -0.763073
H  -1.044799 -0.566909 0.726707
H  1.482477 -0.35426 -0.954717
totalener: -870.41714074 hartree
nucrepener: 1657.32280226 hartree
electener: -2527.73994301 hartree
oneelecener: -4446.47013423 hartree
twoeener: 1918.73019123 hartree
kineticenergy: 866.24365103 hartree
xcener: -89.072442565319 hartree
chargesum: 1.0000000
charge: 0.156212 -0.193736 0.114293 -0.125076 -0.059028 -0.019005 -0.161653 -0.119526 -0.244965 -0.175139 -0.070513 -0.101793 -0.033071 -0.255550 -0.254757 -0.256645 -0.172828 -0.101406 -0.115040 -0.148938 -0.160688 0.202608 0.172559 0.146655 0.149876 0.162082 0.126554 0.133732 0.134056 0.131464 0.140798 0.131291 0.148268 0.129628 0.098525 0.095325 0.098797 0.100469 0.098233 0.098979 0.099347 0.094666 0.095925 0.136279 0.141981 0.147807 0.119925 0.163020
qa: 0.1562 -0.1937 0.1143 -0.1251 -0.0590 -0.0190 -0.1617 -0.1195 -0.2450 -0.1751 -0.0705 -0.1018 -0.0331 -0.2555 -0.2548 -0.2566 -0.1728 -0.1014 -0.1150 -0.1489 -0.1607 0.2026 0.1726 0.1467 0.1499 0.1621 0.1266 0.1337 0.1341 0.1315 0.1408 0.1313 0.1483 0.1296 0.0985 0.0953 0.0988 0.1005 0.0982 0.0990 0.0993 0.0947 0.0959 0.1363 0.1420 0.1478 0.1199 0.1630
va: 3.5740 3.8147 3.3480 3.9771 4.0254 4.1346 3.8933 3.9681 3.9618 3.8531 3.9815 3.9857 3.9208 3.8967 3.8965 3.8975 3.8001 4.0430 3.9960 3.9796 4.0672 3.7150 0.9809 1.0083 1.0063 1.0005 1.0097 1.0102 0.9954 1.0002 0.9994 1.0096 0.9979 1.0100 1.0071 1.0079 1.0078 1.0077 1.0063 1.0076 1.0077 1.0074 1.0080 1.0121 1.0011 0.9970 1.0029 1.0272
dispersion: -0.020979693 hartree
energy: -870.438120435575 hartree
dipole: -16.16385 18.45814 2.29429 -17.06097 16.08352 -0.97745 -10.04624 9.45856 -0.58768
magnitude: 2.56214 au
magnitude: 6.51245 debye
