program: Orca
programVersion: 5.0.2
elementType: N C C C C C C C C C C C C C C C C C C C C C H H H H H H H H H H H H H H H H H H H H H H H H H H
charge: 1
multiplicity: 1
keywords: wb97x-d3
keywords: def2-TZVPP
keywords: def2/J RIJCOSX
keywords: DEFGRID2
keywords: scfconv7
keywords: smallprint printgap noloewdin
keywords: NOSOSCF
formula: C21H26N
InChI: InChI=1/C21H26N/c1-21(2,3)15-8-5-9-16-22(4)17-19-13-10-12-18-11-6-7-14-20(18)19/h5-7,9-14,22H,16-17H2,1-4H3
48 atoms
N  1.532324 -0.996677 0.452148
C  2.577729 -0.405663 1.37051
C  3.139134 0.856613 0.803834
C  2.327429 2.025184 0.730106
C  2.862701 3.179865 0.101649
C  -5.212459 -2.585308 -1.332192
C  0.696188 -2.052033 1.141651
C  4.424309 0.878334 0.32544
C  1.012764 2.097386 1.250883
C  2.119335 -1.488733 -0.818855
C  4.189902 3.155324 -0.384013
C  4.962636 2.036511 -0.261993
C  2.063472 4.338435 -0.015664
C  -5.16586 -1.935869 -2.722615
C  -6.351915 -1.976025 -0.504793
C  -5.412768 -4.100863 -1.467813
C  -0.509058 -2.407938 0.345401
C  0.264348 3.236684 1.125687
C  0.788667 4.366792 0.475009
C  -3.942939 -2.337166 -0.651658
C  -1.705433 -1.869531 0.61911
C  -2.896701 -2.139844 -0.084444
H  3.345819 -1.166962 1.507816
H  2.093372 -0.247599 2.335271
H  1.355207 -2.903414 1.318305
H  0.416413 -1.635537 2.110021
H  5.04177 -0.009301 0.399387
H  0.589176 1.269519 1.809885
H  1.32266 -1.812404 -1.48184
H  2.7814 -2.323981 -0.602434
H  2.679541 -0.687751 -1.2915
H  4.591489 4.045736 -0.851396
H  5.981705 2.030266 -0.622467
H  2.480526 5.213314 -0.49809
H  -5.019435 -0.857915 -2.655028
H  -6.108445 -2.114393 -3.241516
H  -4.36315 -2.352751 -3.330769
H  -6.397862 -2.414103 0.492086
H  -6.233471 -0.897836 -0.397667
H  -7.306894 -2.162069 -0.99771
H  -5.434113 -4.588432 -0.493165
H  -6.361897 -4.302991 -1.965749
H  -4.618261 -4.556553 -2.058906
H  -0.412036 -3.133549 -0.452573
H  -0.732448 3.274724 1.543966
H  0.186871 5.260118 0.381631
H  -1.793851 -1.172856 1.451081
H  0.889768 -0.237279 0.207539
totalener: -870.41711212 hartree
nucrepener: 1628.95610297 hartree
electener: -2499.37321509 hartree
oneelecener: -4389.71847884 hartree
twoeener: 1890.34526374 hartree
kineticenergy: 866.23858815 hartree
xcener: -89.070988758842 hartree
chargesum: 1.0000000
charge: 0.159117 -0.175812 0.063385 -0.087533 -0.050013 -0.022665 -0.148012 -0.126587 -0.244066 -0.206080 -0.074564 -0.095365 -0.033780 -0.255949 -0.254784 -0.253355 -0.154239 -0.102673 -0.115252 -0.155914 -0.159285 0.204812 0.147257 0.167899 0.152219 0.134753 0.126883 0.128692 0.145522 0.132067 0.157066 0.130948 0.147767 0.129127 0.097629 0.099971 0.096094 0.099833 0.095330 0.098295 0.101103 0.098576 0.095287 0.138872 0.140420 0.146837 0.112227 0.167939
qa: 0.1591 -0.1758 0.0634 -0.0875 -0.0500 -0.0227 -0.1480 -0.1266 -0.2441 -0.2061 -0.0746 -0.0954 -0.0338 -0.2559 -0.2548 -0.2534 -0.1542 -0.1027 -0.1153 -0.1559 -0.1593 0.2048 0.1473 0.1679 0.1522 0.1348 0.1269 0.1287 0.1455 0.1321 0.1571 0.1309 0.1478 0.1291 0.0976 0.1000 0.0961 0.0998 0.0953 0.0983 0.1011 0.0986 0.0953 0.1389 0.1404 0.1468 0.1122 0.1679
va: 3.5627 3.8200 3.4161 3.9909 4.0323 4.1395 3.8927 3.9828 3.9686 3.8613 3.9890 3.9809 3.9232 3.8953 3.8961 3.8942 3.7954 4.0472 3.9986 3.9843 4.0764 3.7144 1.0086 0.9853 1.0026 1.0068 1.0091 1.0114 0.9999 0.9972 0.9925 1.0096 0.9981 1.0100 1.0074 1.0070 1.0077 1.0078 1.0083 1.0071 1.0074 1.0069 1.0084 1.0112 1.0016 0.9973 1.0051 1.0190
dispersion: -0.020571618 hartree
energy: -870.437683742063 hartree
dipole: -19.97219 21.75148 1.77929 -17.50568 16.62509 -0.88059 -6.87759 7.12815 0.25055
magnitude: 2.00102 au
magnitude: 5.08620 debye
