program: Orca
programVersion: 5.0.2
elementType: N C C C C C C C C C C C C C C C C C C C C C H H H H H H H H H H H H H H H H H H H H H H H H H H
charge: 1
multiplicity: 1
keywords: wb97x-d3
keywords: def2-TZVPP
keywords: def2/J RIJCOSX
keywords: DEFGRID2
keywords: scfconv7
keywords: smallprint printgap noloewdin
keywords: NOSOSCF
formula: C21H26N
InChI: InChI=1/C21H26N/c1-21(2,3)15-8-5-9-16-22(4)17-19-13-10-12-18-11-6-7-14-20(18)19/h5-7,9-14,22H,16-17H2,1-4H3
48 atoms
N  1.022109 -0.090684 -0.670338
C  0.496477 1.084164 0.124944
C  1.544543 1.618225 1.045414
C  2.679305 2.299735 0.519108
C  3.698681 2.706974 1.419184
C  -5.403116 -3.436507 -0.586906
C  0.132381 -0.433633 -1.847154
C  1.428782 1.412481 2.396375
C  2.846165 2.592843 -0.856074
C  1.299756 -1.268782 0.18734
C  3.540245 2.469187 2.803391
C  2.42448 1.849277 3.287404
C  4.849667 3.352842 0.91649
C  -5.779374 -2.975859 0.827498
C  -5.407265 -4.96855 -0.660236
C  -6.395871 -2.859068 -1.605817
C  -1.239523 -0.830726 -1.439647
C  3.97238 3.223251 -1.312567
C  4.991926 3.597709 -0.420143
C  -4.064208 -2.944989 -0.906764
C  -1.66349 -2.09922 -1.510704
C  -2.964437 -2.530206 -1.178525
H  -0.376436 0.729968 0.67118
H  0.157472 1.82506 -0.601422
H  0.123831 0.454632 -2.482242
H  0.637168 -1.231575 -2.39283
H  0.55594 0.90508 2.790511
H  2.059559 2.375413 -1.571223
H  0.36769 -1.621488 0.619738
H  1.992835 -0.984079 0.973155
H  1.739179 -2.056041 -0.41989
H  4.319698 2.793471 3.48133
H  2.304885 1.682115 4.348591
H  5.621605 3.658562 1.611372
H  -6.778168 -3.335783 1.076948
H  -5.785412 -1.888653 0.904258
H  -5.086273 -3.367519 1.572034
H  -4.705354 -5.403341 0.051161
H  -6.40275 -5.346287 -0.423741
H  -5.142645 -5.319717 -1.65732
H  -6.411466 -1.76984 -1.574159
H  -6.149144 -3.167041 -2.621463
H  -7.401017 -3.217338 -1.380162
H  -1.927535 -0.052525 -1.131539
H  4.073485 3.449474 -2.365444
H  5.87729 4.093394 -0.793371
H  -0.978332 -2.86973 -1.858583
H  1.918131 0.212234 -1.060421
totalener: -870.41677207 hartree
nucrepener: 1615.85485841 hartree
electener: -2486.27163047 hartree
oneelecener: -4363.58278249 hartree
twoeener: 1877.31115202 hartree
kineticenergy: 866.24689713 hartree
xcener: -89.074386233086 hartree
chargesum: 1.0000000
charge: 0.175050 -0.174957 0.040049 -0.085941 -0.046067 -0.022096 -0.140732 -0.123792 -0.264358 -0.231478 -0.072310 -0.098500 -0.034127 -0.256828 -0.255016 -0.254030 -0.173344 -0.103576 -0.115068 -0.147078 -0.158740 0.202699 0.147407 0.174965 0.148429 0.145370 0.127902 0.139803 0.145344 0.164025 0.142055 0.131331 0.147375 0.129448 0.100143 0.094514 0.096350 0.095978 0.098684 0.100039 0.095974 0.101649 0.099077 0.136149 0.142389 0.147086 0.117029 0.171722
qa: 0.1750 -0.1750 0.0400 -0.0859 -0.0461 -0.0221 -0.1407 -0.1238 -0.2644 -0.2315 -0.0723 -0.0985 -0.0341 -0.2568 -0.2550 -0.2540 -0.1733 -0.1036 -0.1151 -0.1471 -0.1587 0.2027 0.1474 0.1750 0.1484 0.1454 0.1279 0.1398 0.1453 0.1640 0.1421 0.1313 0.1474 0.1294 0.1001 0.0945 0.0964 0.0960 0.0987 0.1000 0.0960 0.1016 0.0991 0.1361 0.1424 0.1471 0.1170 0.1717
va: 3.5274 3.8345 3.4467 3.9806 4.0269 4.1368 3.8815 3.9780 3.9755 3.8841 3.9854 3.9826 3.9223 3.8960 3.8959 3.8935 3.7815 4.0435 3.9967 3.9677 4.0453 3.7100 1.0039 0.9759 1.0034 1.0000 1.0087 1.0097 0.9901 0.9909 0.9957 1.0096 0.9984 1.0099 1.0076 1.0080 1.0075 1.0081 1.0067 1.0078 1.0081 1.0075 1.0064 1.0158 1.0011 0.9972 1.0046 1.0049
dispersion: -0.020715663 hartree
energy: -870.437487730590 hartree
dipole: -23.86836 25.18764 1.31929 -18.37070 18.23613 -0.13457 -4.04121 3.55186 -0.48935
magnitude: 1.41354 au
magnitude: 3.59293 debye
