program: Orca
programVersion: 5.0.2
elementType: N C C C C C C C C C C C C C C C C C C C C C H H H H H H H H H H H H H H H H H H H H H H H H H H
charge: 1
multiplicity: 1
keywords: wb97x-d3
keywords: def2-TZVPP
keywords: def2/J RIJCOSX
keywords: DEFGRID2
keywords: scfconv7
keywords: smallprint printgap noloewdin
keywords: NOSOSCF
formula: C21H26N
InChI: InChI=1/C21H26N/c1-21(2,3)15-8-5-9-16-22(4)17-19-13-10-12-18-11-6-7-14-20(18)19/h5-7,9-14,22H,16-17H2,1-4H3
48 atoms
N  1.583466 -0.772136 -0.843837
C  1.183923 0.038883 0.368835
C  1.322538 1.507487 0.113172
C  2.463674 2.254411 0.525585
C  2.517384 3.635573 0.191471
C  -5.200667 -3.20414 -0.024562
C  1.101162 -2.205085 -0.750552
C  0.297524 2.130671 -0.558595
C  3.543774 1.706443 1.257863
C  3.038927 -0.703265 -1.129105
C  1.450586 4.226117 -0.520571
C  0.356759 3.494209 -0.885206
C  3.637606 4.403536 0.582196
C  -5.563871 -3.885856 -1.350361
C  -5.881583 -1.830749 0.061023
C  -5.636874 -4.081237 1.15597
C  -0.375946 -2.304499 -0.86788
C  4.612099 2.476951 1.625149
C  4.665915 3.839853 1.280746
C  -3.752219 -3.013138 0.029284
C  -1.158228 -2.69512 0.146759
C  -2.556738 -2.855301 0.064633
H  1.781005 -0.330533 1.201304
H  0.144345 -0.217839 0.568184
H  1.600274 -2.746372 -1.556291
H  1.470836 -2.59828 0.197488
H  -0.589373 1.566833 -0.830425
H  3.533937 0.667657 1.561133
H  3.582469 -1.180709 -0.317623
H  3.348658 0.333893 -1.2154
H  3.245441 -1.225731 -2.059595
H  1.506744 5.279224 -0.765802
H  -0.465232 3.957034 -1.41294
H  3.665628 5.454028 0.321959
H  -5.260811 -3.281002 -2.204807
H  -6.643563 -4.030036 -1.405523
H  -5.089487 -4.862886 -1.438632
H  -5.637211 -1.321716 0.993274
H  -5.587524 -1.187004 -0.767752
H  -6.964178 -1.956721 0.020727
H  -5.16215 -5.06148 1.120156
H  -5.388062 -3.617454 2.110309
H  -6.717019 -4.22939 1.125465
H  -0.815092 -2.107431 -1.840143
H  5.420847 2.037307 2.193057
H  5.516767 4.436864 1.578352
H  -0.703876 -2.926297 1.108033
H  1.101872 -0.340813 -1.636131
totalener: -870.41534939 hartree
nucrepener: 1620.63905782 hartree
electener: -2491.05440721 hartree
oneelecener: -4373.31550712 hartree
twoeener: 1882.26109991 hartree
kineticenergy: 866.24024163 hartree
xcener: -89.071353698692 hartree
chargesum: 1.0000000
charge: 0.191434 -0.241642 0.133326 -0.114413 -0.033499 -0.023129 -0.110009 -0.174604 -0.215021 -0.214946 -0.067314 -0.126307 -0.035939 -0.253809 -0.257413 -0.254083 -0.167367 -0.096554 -0.114749 -0.136051 -0.191007 0.204993 0.156386 0.191124 0.144860 0.133355 0.143084 0.112716 0.131694 0.161466 0.141206 0.130317 0.145827 0.126854 0.093460 0.098684 0.101282 0.099343 0.094100 0.100239 0.099995 0.097682 0.098003 0.133615 0.141384 0.146452 0.123498 0.151476
qa: 0.1914 -0.2416 0.1333 -0.1144 -0.0335 -0.0231 -0.1100 -0.1746 -0.2150 -0.2149 -0.0673 -0.1263 -0.0359 -0.2538 -0.2574 -0.2541 -0.1674 -0.0966 -0.1147 -0.1361 -0.1910 0.2050 0.1564 0.1911 0.1449 0.1334 0.1431 0.1127 0.1317 0.1615 0.1412 0.1303 0.1458 0.1269 0.0935 0.0987 0.1013 0.0993 0.0941 0.1002 0.1000 0.0977 0.0980 0.1336 0.1414 0.1465 0.1235 0.1515
va: 3.5962 3.8740 3.3371 3.8833 4.0047 4.1361 3.8518 4.0046 3.9700 3.8734 3.9929 4.0195 3.9193 3.8940 3.8963 3.8957 3.7967 4.0256 3.9915 3.9572 4.0600 3.7279 1.0036 0.9865 0.9988 1.0040 1.0019 1.0162 0.9925 0.9884 1.0016 1.0097 0.9996 1.0111 1.0085 1.0072 1.0073 1.0073 1.0076 1.0071 1.0078 1.0080 1.0069 1.0181 0.9991 0.9973 1.0006 1.0147
dispersion: -0.020536654 hartree
energy: -870.435886044576 hartree
dipole: -18.22457 20.11139 1.88682 -18.68878 17.94729 -0.74150 -3.19967 2.26031 -0.93936
magnitude: 2.23435 au
magnitude: 5.67927 debye
