program: Orca
programVersion: 5.0.2
elementType: N C C C C C C C C C C C C C C C C C C C C C H H H H H H H H H H H H H H H H H H H H H H H H H H
charge: 1
multiplicity: 1
keywords: wb97x-d3
keywords: def2-TZVPP
keywords: def2/J RIJCOSX
keywords: DEFGRID2
keywords: scfconv7
keywords: smallprint printgap noloewdin
keywords: NOSOSCF
formula: C21H26N
InChI: InChI=1/C21H26N/c1-21(2,3)15-8-5-9-16-22(4)17-19-13-10-12-18-11-6-7-14-20(18)19/h5-7,9-14,22H,16-17H2,1-4H3
48 atoms
N  1.272096 -0.188306 -1.152931
C  1.79103 -0.350349 0.250132
C  1.881923 0.953764 0.979221
C  2.900461 1.90055 0.663423
C  2.905003 3.148449 1.343323
C  -5.073527 -3.622081 -0.389047
C  -0.116458 0.385592 -1.237086
C  0.959305 1.243445 1.951958
C  3.91357 1.658656 -0.296597
C  1.404625 -1.455103 -1.912497
C  1.927664 3.407055 2.332908
C  0.982239 2.471228 2.640326
C  3.891772 4.110088 1.025867
C  -4.505307 -4.764545 0.46034
C  -5.728775 -4.187126 -1.65389
C  -6.104805 -2.830884 0.423984
C  -1.161392 -0.535792 -0.715383
C  4.857265 2.608595 -0.580934
C  4.84441 3.851543 0.079741
C  -3.985996 -2.720653 -0.776303
C  -2.05735 -1.106172 -1.526203
C  -3.093882 -1.971264 -1.091313
H  2.759337 -0.842993 0.161026
H  1.121818 -1.041347 0.760098
H  -0.099666 1.325612 -0.685919
H  -0.280303 0.615435 -2.289037
H  0.192609 0.516743 2.193139
H  3.974951 0.705268 -0.80704
H  0.858059 -2.244613 -1.405057
H  2.458093 -1.715063 -1.970197
H  1.007995 -1.313167 -2.914173
H  1.944376 4.36004 2.847874
H  0.243023 2.668812 3.405195
H  3.881974 5.058746 1.548909
H  -5.308268 -5.443039 0.754321
H  -4.032909 -4.389218 1.368938
H  -3.763746 -5.342335 -0.093057
H  -5.014167 -4.750472 -2.255301
H  -6.543781 -4.860608 -1.382536
H  -6.142321 -3.392803 -2.276698
H  -5.662192 -2.411082 1.328207
H  -6.526682 -2.011208 -0.158882
H  -6.924263 -3.486934 0.723452
H  -1.204474 -0.709624 0.354032
H  5.623436 2.399456 -1.316127
H  5.594322 4.594558 -0.158156
H  -2.011126 -0.910885 -2.594448
H  1.870516 0.494996 -1.623966
elementType: N C H
totalener: -870.50704880 hartree
nucrepener: 1627.76265410 hartree
electener: -2498.26970290 hartree
oneelecener: -4386.82190535 hartree
twoeener: 1888.55220245 hartree
cpcmener: -0.09734299 hartree
kineticenergy: 866.20610884 hartree
xcener: -89.066527506195 hartree
chargesum: 1.0000000
charge: 0.218475 -0.139116 0.054885 -0.074544 -0.053805 0.053502 -0.113599 -0.115938 -0.226949 -0.208740 -0.121341 -0.144050 -0.082853 -0.285880 -0.288139 -0.285867 -0.157496 -0.146083 -0.146676 -0.255760 -0.190802 0.230737 0.165852 0.152898 0.159049 0.150241 0.147251 0.148801 0.138027 0.144502 0.142680 0.146080 0.159365 0.144956 0.098692 0.100625 0.101125 0.100699 0.098037 0.101591 0.100476 0.102241 0.098461 0.138044 0.158113 0.159959 0.139621 0.182652
qa: 0.2185 -0.1391 0.0549 -0.0745 -0.0538 0.0535 -0.1136 -0.1159 -0.2269 -0.2087 -0.1213 -0.1440 -0.0829 -0.2859 -0.2881 -0.2859 -0.1575 -0.1461 -0.1467 -0.2558 -0.1908 0.2307 0.1659 0.1529 0.1590 0.1502 0.1473 0.1488 0.1380 0.1445 0.1427 0.1461 0.1594 0.1450 0.0987 0.1006 0.1011 0.1007 0.0980 0.1016 0.1005 0.1022 0.0985 0.1380 0.1581 0.1600 0.1396 0.1827
va: 3.5981 3.8182 3.4340 3.9051 3.9092 4.0378 3.9211 3.8964 3.9453 3.8771 3.9334 3.9244 3.8768 3.8923 3.8941 3.8936 3.8558 3.9418 3.9172 4.0886 4.0094 3.6755 0.9849 0.9937 0.9880 0.9978 1.0017 1.0053 0.9901 0.9966 0.9927 1.0034 0.9914 1.0043 1.0035 1.0060 1.0055 1.0056 1.0034 1.0056 1.0059 1.0055 1.0033 1.0148 0.9930 0.9897 1.0031 0.9904
dispersion: -0.020972705 hartree
energy: -870.528021502013 hartree
dipole: -20.68779 22.65808 1.97029 -20.87766 20.48378 -0.39388 -6.17414 4.35052 -1.82362
magnitude: 2.71344 au
magnitude: 6.89701 debye
