program: Orca
programVersion: 5.0.2
elementType: N C C C C C C C C C C C C C C C C C C C C C H H H H H H H H H H H H H H H H H H H H H H H H H H
charge: 1
multiplicity: 1
keywords: wb97x-d3
keywords: def2-TZVPP
keywords: def2/J RIJCOSX
keywords: DEFGRID2
keywords: scfconv7
keywords: smallprint printgap noloewdin
keywords: NOSOSCF
formula: C21H26N
InChI: InChI=1/C21H26N/c1-21(2,3)15-8-5-9-16-22(4)17-19-13-10-12-18-11-6-7-14-20(18)19/h5-7,9-14,22H,16-17H2,1-4H3
48 atoms
N  2.646079 -1.777175 0.515818
C  2.218989 -0.717258 1.490883
C  2.470638 0.671492 0.974922
C  1.413161 1.586688 0.698781
C  1.746776 2.870691 0.181528
C  -4.483896 -1.758346 -0.829187
C  1.930166 -1.732368 -0.805858
C  3.774407 1.060428 0.782275
C  0.044272 1.300999 0.928652
C  2.588024 -3.119091 1.148132
C  3.101008 3.214162 -0.027177
C  4.097387 2.330793 0.276176
C  0.716821 3.795114 -0.112305
C  -5.094278 -1.904033 -2.228085
C  -5.099626 -0.54807 -0.117592
C  -4.741839 -3.029064 -0.012351
C  0.475213 -2.018404 -0.690686
C  -0.928521 2.217821 0.63799
C  -0.593715 3.47782 0.105911
C  -3.038788 -1.55305 -0.953471
C  -0.448853 -1.153365 -1.116576
C  -1.84594 -1.389603 -1.038643
H  2.802639 -0.8974 2.393711
H  1.17854 -0.916319 1.731232
H  2.11411 -0.750388 -1.239504
H  2.431501 -2.475143 -1.428812
H  4.583102 0.380589 1.02892
H  -0.255802 0.350983 1.346892
H  2.879342 -3.869476 0.418453
H  1.580428 -3.314508 1.502702
H  3.27647 -3.138923 1.988465
H  3.337684 4.195599 -0.420216
H  5.135066 2.601879 0.133959
H  0.987992 4.765324 -0.510936
H  -4.672839 -2.758114 -2.759754
H  -4.925098 -1.011628 -2.831785
H  -6.17212 -2.056644 -2.147405
H  -4.683382 -0.419015 0.882442
H  -4.92844 0.372602 -0.676869
H  -6.177842 -0.685383 -0.017573
H  -4.308015 -3.906844 -0.493067
H  -4.320865 -2.94978 0.990833
H  -5.815827 -3.196633 0.086532
H  0.172348 -2.978681 -0.28934
H  -1.966479 1.972178 0.822232
H  -1.374457 4.191972 -0.120596
H  -0.14032 -0.203656 -1.543707
H  3.630059 -1.606244 0.294727
elementType: N C H
totalener: -870.50437625 hartree
nucrepener: 1707.63636021 hartree
electener: -2578.14073645 hartree
oneelecener: -4546.97284988 hartree
twoeener: 1968.83211343 hartree
cpcmener: -0.09899375 hartree
kineticenergy: 866.20969708 hartree
xcener: -89.069710694556 hartree
chargesum: 1.0000000
charge: 0.209289 -0.101000 0.024507 -0.006883 -0.047055 0.073582 -0.109366 -0.151183 -0.286195 -0.195417 -0.115279 -0.150072 -0.074330 -0.288175 -0.296011 -0.289920 -0.116160 -0.088444 -0.168367 -0.227493 -0.266700 0.225148 0.160699 0.146774 0.144992 0.156087 0.140906 0.145488 0.141789 0.132710 0.139383 0.145631 0.159388 0.142905 0.102078 0.101590 0.098766 0.100628 0.101628 0.100946 0.100855 0.099990 0.098213 0.142246 0.158822 0.158488 0.147173 0.177349
qa: 0.2093 -0.1010 0.0245 -0.0069 -0.0471 0.0736 -0.1094 -0.1512 -0.2862 -0.1954 -0.1153 -0.1501 -0.0743 -0.2882 -0.2960 -0.2899 -0.1162 -0.0884 -0.1684 -0.2275 -0.2667 0.2251 0.1607 0.1468 0.1450 0.1561 0.1409 0.1455 0.1418 0.1327 0.1394 0.1456 0.1594 0.1429 0.1021 0.1016 0.0988 0.1006 0.1016 0.1009 0.1009 0.1000 0.0982 0.1422 0.1588 0.1585 0.1472 0.1773
va: 3.6414 3.8110 3.5261 3.7039 3.9244 4.0196 3.9113 3.9365 3.9243 3.8705 3.9257 3.9107 3.8629 3.8963 3.8978 3.8963 3.8161 3.8611 3.9469 4.0444 4.0054 3.6671 0.9908 0.9972 0.9955 0.9900 1.0027 1.0072 0.9930 0.9935 0.9960 1.0039 0.9908 1.0047 1.0053 1.0055 1.0030 1.0051 1.0053 1.0040 1.0055 1.0053 1.0037 1.0062 0.9921 0.9904 0.9888 0.9926
dispersion: -0.023064042 hartree
energy: -870.527440287741 hartree
dipole: -14.72666 18.93052 4.20386 -17.17658 14.17335 -3.00323 -0.62500 1.57706 0.95207
magnitude: 5.25340 au
magnitude: 13.35309 debye
