program: Orca
programVersion: 5.0.2
elementType: N C C C C C C C C C C C C C C C C C C C C C H H H H H H H H H H H H H H H H H H H H H H H H H H
charge: 1
multiplicity: 1
keywords: wb97x-d3
keywords: def2-TZVPP
keywords: def2/J RIJCOSX
keywords: DEFGRID2
keywords: scfconv7
keywords: smallprint printgap noloewdin
keywords: NOSOSCF
formula: C21H26N
InChI: InChI=1/C21H26N/c1-21(2,3)15-8-5-9-16-22(4)17-19-13-10-12-18-11-6-7-14-20(18)19/h5-7,9-14,22H,16-17H2,1-4H3
48 atoms
N  2.851954 -1.721568 0.044658
C  2.384638 -0.94255 1.24129
C  2.44656 0.542949 1.020937
C  1.28168 1.365255 1.019211
C  1.435735 2.756719 0.758363
C  -4.328565 -1.580074 -1.074178
C  2.087034 -1.444916 -1.220377
C  3.680832 1.113968 0.825652
C  -0.025637 0.882699 1.278771
C  2.924644 -3.170024 0.362735
C  2.723005 3.291568 0.53062
C  3.826746 2.488277 0.572163
C  0.296086 3.595139 0.735146
C  -4.810965 -1.017751 0.268607
C  -4.595836 -3.087953 -1.133511
C  -5.05587 -0.874007 -2.22361
C  0.643552 -1.787981 -1.121384
C  -1.107145 1.719514 1.254728
C  -0.950633 3.0905 0.972877
C  -2.888197 -1.342202 -1.194164
C  -0.308559 -0.877442 -1.341307
C  -1.699084 -1.151417 -1.27523
H  3.047034 -1.235683 2.055711
H  1.392068 -1.310736 1.483743
H  2.231707 -0.392481 -1.459803
H  2.584355 -2.03517 -1.991987
H  4.572843 0.497692 0.866942
H  -0.191304 -0.160401 1.506423
H  3.619688 -3.311928 1.18575
H  3.279644 -3.70701 -0.512675
H  1.943541 -3.534848 0.65212
H  2.821916 4.352198 0.333152
H  4.814318 2.900958 0.414351
H  0.431992 4.649838 0.527803
H  -4.302434 -1.495963 1.106815
H  -5.882624 -1.192666 0.380563
H  -4.63819 0.05733 0.335506
H  -4.26228 -3.514594 -2.080327
H  -4.085565 -3.615105 -0.326209
H  -5.665931 -3.280266 -1.036716
H  -4.879064 0.202126 -2.205183
H  -4.732966 -1.254057 -3.193625
H  -6.131542 -1.039425 -2.139495
H  0.372311 -2.815713 -0.907097
H  -2.093873 1.322172 1.454914
H  -1.816589 3.739162 0.952942
H  -0.029188 0.145188 -1.57773
H  3.81111 -1.425658 -0.153935
elementType: N C H
totalener: -870.50409687 hartree
nucrepener: 1720.96187154 hartree
electener: -2591.46596841 hartree
oneelecener: -4573.69490314 hartree
twoeener: 1982.22893473 hartree
cpcmener: -0.09952579 hartree
kineticenergy: 866.20688828 hartree
xcener: -89.069840401860 hartree
chargesum: 1.0000000
charge: 0.208188 -0.111690 0.036088 -0.034656 -0.040396 0.075586 -0.112094 -0.148772 -0.260203 -0.191787 -0.116628 -0.147077 -0.076862 -0.300983 -0.288365 -0.288153 -0.117314 -0.100493 -0.167099 -0.239316 -0.249132 0.222208 0.160940 0.147827 0.144310 0.155809 0.137889 0.145958 0.139146 0.140980 0.133083 0.144662 0.159951 0.142720 0.102488 0.102770 0.099815 0.101733 0.099498 0.098228 0.101428 0.101850 0.098617 0.143709 0.163981 0.158492 0.144967 0.178098
qa: 0.2082 -0.1117 0.0361 -0.0347 -0.0404 0.0756 -0.1121 -0.1488 -0.2602 -0.1918 -0.1166 -0.1471 -0.0769 -0.3010 -0.2884 -0.2882 -0.1173 -0.1005 -0.1671 -0.2393 -0.2491 0.2222 0.1609 0.1478 0.1443 0.1558 0.1379 0.1460 0.1391 0.1410 0.1331 0.1447 0.1600 0.1427 0.1025 0.1028 0.0998 0.1017 0.0995 0.0982 0.1014 0.1019 0.0986 0.1437 0.1640 0.1585 0.1450 0.1781
va: 3.6412 3.8138 3.5194 3.7058 3.9157 4.0149 3.9172 3.9311 3.9037 3.8674 3.9263 3.9068 3.8696 3.8995 3.8946 3.8947 3.8070 3.8659 3.9516 4.0596 4.0036 3.6538 0.9916 0.9962 0.9963 0.9906 1.0042 1.0092 0.9956 0.9940 0.9949 1.0041 0.9905 1.0047 1.0042 1.0045 1.0051 1.0055 1.0057 1.0037 1.0053 1.0056 1.0031 1.0067 0.9884 0.9907 0.9903 0.9918
dispersion: -0.023640076 hartree
energy: -870.527736945288 hartree
dipole: -13.04979 17.59550 4.54570 -16.48332 13.55133 -2.93200 -4.00631 4.15476 0.14845
magnitude: 5.41129 au
magnitude: 13.75441 debye
