program: Orca
programVersion: 5.0.2
elementType: N C C C C C C C C C C C C C C C C C C C C C H H H H H H H H H H H H H H H H H H H H H H H H H H
charge: 1
multiplicity: 1
keywords: wb97x-d3
keywords: def2-TZVPP
keywords: def2/J RIJCOSX
keywords: DEFGRID2
keywords: scfconv7
keywords: smallprint printgap noloewdin
keywords: NOSOSCF
formula: C21H26N
InChI: InChI=1/C21H26N/c1-21(2,3)15-8-5-9-16-22(4)17-19-13-10-12-18-11-6-7-14-20(18)19/h5-7,9-14,22H,16-17H2,1-4H3
48 atoms
N  2.747546 -1.742468 0.253811
C  2.270617 -0.838584 1.354937
C  2.441028 0.6161 1.017243
C  1.334118 1.501264 0.864477
C  1.593204 2.851575 0.493697
C  -4.398917 -1.722983 -0.941873
C  2.01432 -1.574455 -1.049309
C  3.719855 1.095057 0.864504
C  -0.014124 1.121958 1.080659
C  2.774111 -3.153046 0.714031
C  2.92456 3.288735 0.315554
C  3.969907 2.431406 0.509403
C  0.512565 3.747248 0.315009
C  -5.129808 -0.379386 -0.845169
C  -4.650085 -2.546998 0.326336
C  -4.892548 -2.496693 -2.169989
C  0.568195 -1.906712 -0.949426
C  -1.037229 2.012884 0.905795
C  -0.776348 3.339057 0.509974
C  -2.960314 -1.480401 -1.074201
C  -0.381786 -1.018633 -1.254296
C  -1.772349 -1.290402 -1.172952
H  2.870147 -1.098915 2.226985
H  1.245175 -1.125351 1.569051
H  2.169201 -0.546922 -1.375166
H  2.526075 -2.231882 -1.754117
H  4.56523 0.433817 1.023856
H  -0.257302 0.117534 1.396256
H  3.12115 -3.784694 -0.099046
H  1.779904 -3.45845 1.025893
H  3.456593 -3.232955 1.555606
H  3.104136 4.319818 0.035371
H  4.990252 2.771917 0.39346
H  0.727838 4.768371 0.023706
H  -4.963302 0.229863 -1.734311
H  -4.799915 0.19246 0.023586
H  -6.204227 -0.54651 -0.7482
H  -4.138497 -3.50954 0.284025
H  -4.307265 -2.020251 1.218056
H  -5.718621 -2.739327 0.439754
H  -4.728781 -1.933019 -3.089222
H  -4.385369 -3.457493 -2.266739
H  -5.963244 -2.689179 -2.080016
H  0.29334 -2.913445 -0.655277
H  -2.057887 1.694154 1.074749
H  -1.596265 4.031443 0.37057
H  -0.101615 -0.017707 -1.568775
H  3.717852 -1.489039 0.050445
elementType: N C H
totalener: -870.50405094 hartree
nucrepener: 1713.42710197 hartree
electener: -2583.93115291 hartree
oneelecener: -4558.55478253 hartree
twoeener: 1974.62362963 hartree
cpcmener: -0.09903382 hartree
kineticenergy: 866.20490430 hartree
xcener: -89.068972496720 hartree
chargesum: 1.0000000
charge: 0.209718 -0.106705 0.030840 -0.018362 -0.044568 0.066601 -0.110089 -0.151880 -0.277310 -0.193599 -0.116065 -0.149043 -0.074723 -0.293053 -0.288064 -0.287608 -0.119622 -0.090655 -0.169603 -0.239389 -0.251583 0.229533 0.160128 0.147081 0.145764 0.155687 0.139708 0.148034 0.141340 0.132974 0.139278 0.145260 0.159778 0.142678 0.102655 0.099647 0.099233 0.100622 0.100622 0.098388 0.102026 0.101387 0.098591 0.142288 0.160880 0.158336 0.145606 0.177238
qa: 0.2097 -0.1067 0.0308 -0.0184 -0.0446 0.0666 -0.1101 -0.1519 -0.2773 -0.1936 -0.1161 -0.1490 -0.0747 -0.2931 -0.2881 -0.2876 -0.1196 -0.0907 -0.1696 -0.2394 -0.2516 0.2295 0.1601 0.1471 0.1458 0.1557 0.1397 0.1480 0.1413 0.1330 0.1393 0.1453 0.1598 0.1427 0.1027 0.0996 0.0992 0.1006 0.1006 0.0984 0.1020 0.1014 0.0986 0.1423 0.1609 0.1583 0.1456 0.1772
va: 3.6412 3.8166 3.5225 3.7114 3.9204 4.0302 3.9136 3.9342 3.9164 3.8685 3.9259 3.9096 3.8653 3.8975 3.8927 3.8939 3.8183 3.8582 3.9513 4.0567 4.0036 3.6465 0.9911 0.9975 0.9954 0.9908 1.0031 1.0069 0.9936 0.9942 0.9957 1.0039 0.9907 1.0047 1.0052 1.0064 1.0037 1.0057 1.0057 1.0037 1.0058 1.0056 1.0030 1.0067 0.9921 0.9906 0.9890 0.9927
dispersion: -0.023288656 hartree
energy: -870.527339597128 hartree
dipole: -13.81757 18.18900 4.37143 -17.15219 14.18834 -2.96385 -2.38065 2.89258 0.51193
magnitude: 5.30621 au
magnitude: 13.48732 debye
