program: Orca
programVersion: 5.0.2
elementType: N C C C C C C C C C C C C C C C C C C C C C H H H H H H H H H H H H H H H H H H H H H H H H H H
charge: 1
multiplicity: 1
keywords: wb97x-d3
keywords: def2-TZVPP
keywords: def2/J RIJCOSX
keywords: DEFGRID2
keywords: scfconv7
keywords: smallprint printgap noloewdin
keywords: NOSOSCF
formula: C21H26N
InChI: InChI=1/C21H26N/c1-21(2,3)15-8-5-9-16-22(4)17-19-13-10-12-18-11-6-7-14-20(18)19/h5-7,9-14,22H,16-17H2,1-4H3
48 atoms
N  2.800579 -1.742559 0.079752
C  2.326085 -0.963114 1.273526
C  2.439502 0.521401 1.069078
C  1.300653 1.377837 1.020284
C  1.5066 2.763518 0.764072
C  -4.355446 -1.586315 -1.099951
C  2.057452 -1.449918 -1.194733
C  3.697585 1.055799 0.92904
C  -0.029771 0.93449 1.227069
C  2.850389 -3.193242 0.390273
C  2.818084 3.260504 0.595448
C  3.895202 2.425804 0.687482
C  0.393705 3.633843 0.686426
C  -4.612704 -2.45383 0.137882
C  -4.841501 -2.316608 -2.357139
C  -5.087248 -0.24713 -0.96038
C  0.611503 -1.789121 -1.120645
C  -1.084871 1.801576 1.151074
C  -0.876468 3.165637 0.869107
C  -2.916225 -1.339799 -1.21361
C  -0.335839 -0.875572 -1.348274
C  -1.727129 -1.148652 -1.293611
H  2.959221 -1.284191 2.100236
H  1.317337 -1.303224 1.487445
H  2.21025 -0.395967 -1.421818
H  2.564606 -2.035102 -1.963806
H  4.567645 0.41218 1.006285
H  -0.234146 -0.101886 1.454415
H  3.20696 -3.729949 -0.484584
H  1.86191 -3.546748 0.667807
H  3.534901 -3.349338 1.219533
H  2.956607 4.317713 0.403176
H  4.900637 2.809752 0.576765
H  0.568985 4.68325 0.481604
H  -4.100471 -3.414202 0.064574
H  -5.681675 -2.650058 0.239792
H  -4.273928 -1.958125 1.048757
H  -4.67417 -1.720209 -3.254833
H  -4.33212 -3.272537 -2.485896
H  -5.912298 -2.513905 -2.279697
H  -4.762763 0.293117 -0.069613
H  -4.914792 0.393579 -1.825993
H  -6.162263 -0.417232 -0.876321
H  0.334129 -2.817238 -0.915753
H  -2.090794 1.433678 1.308274
H  -1.72172 3.838535 0.80672
H  -0.052479 0.148031 -1.574768
H  3.76606 -1.456839 -0.102829
elementType: N C H
totalener: -870.50399176 hartree
nucrepener: 1718.63490292 hartree
electener: -2589.13889468 hartree
oneelecener: -4569.00429775 hartree
twoeener: 1979.86540307 hartree
cpcmener: -0.09931957 hartree
kineticenergy: 866.20653524 hartree
xcener: -89.069541228103 hartree
chargesum: 1.0000000
charge: 0.208215 -0.110270 0.029571 -0.025573 -0.041337 0.064618 -0.110905 -0.148402 -0.264444 -0.192650 -0.116971 -0.148430 -0.075965 -0.287446 -0.287179 -0.291759 -0.118863 -0.097123 -0.168256 -0.245610 -0.245536 0.231131 0.160845 0.147892 0.144432 0.155790 0.139163 0.145957 0.141208 0.132938 0.139382 0.144803 0.159846 0.142723 0.100492 0.098477 0.100495 0.102109 0.101133 0.098664 0.098735 0.102668 0.099230 0.143321 0.161533 0.158758 0.144765 0.177829
qa: 0.2082 -0.1103 0.0296 -0.0256 -0.0413 0.0646 -0.1109 -0.1484 -0.2644 -0.1926 -0.1170 -0.1484 -0.0760 -0.2874 -0.2872 -0.2918 -0.1189 -0.0971 -0.1683 -0.2456 -0.2455 0.2311 0.1608 0.1479 0.1444 0.1558 0.1392 0.1460 0.1412 0.1329 0.1394 0.1448 0.1598 0.1427 0.1005 0.0985 0.1005 0.1021 0.1011 0.0987 0.0987 0.1027 0.0992 0.1433 0.1615 0.1588 0.1448 0.1778
va: 3.6405 3.8183 3.5223 3.7055 3.9161 4.0312 3.9161 3.9307 3.9049 3.8676 3.9258 3.9088 3.8682 3.8925 3.8936 3.8970 3.8129 3.8620 3.9524 4.0629 4.0026 3.6388 0.9916 0.9967 0.9961 0.9905 1.0035 1.0086 0.9938 0.9947 0.9956 1.0040 0.9906 1.0046 1.0058 1.0037 1.0058 1.0057 1.0057 1.0030 1.0066 1.0052 1.0036 1.0068 0.9914 0.9904 0.9898 0.9922
dispersion: -0.023517994 hartree
energy: -870.527509750664 hartree
dipole: -13.38030 17.84539 4.46509 -16.62109 13.64958 -2.97151 -4.05548 4.25879 0.20331
magnitude: 5.36733 au
magnitude: 13.64268 debye
