program: Orca
programVersion: 5.0.2
elementType: N C C C C C C C C C C C C C C C C C C C C C H H H H H H H H H H H H H H H H H H H H H H H H H H
charge: 1
multiplicity: 1
keywords: wb97x-d3
keywords: def2-TZVPP
keywords: def2/J RIJCOSX
keywords: DEFGRID2
keywords: scfconv7
keywords: smallprint printgap noloewdin
keywords: NOSOSCF
formula: C21H26N
InChI: InChI=1/C21H26N/c1-21(2,3)15-8-5-9-16-22(4)17-19-13-10-12-18-11-6-7-14-20(18)19/h5-7,9-14,22H,16-17H2,1-4H3
48 atoms
N  2.874091 -1.727094 0.021932
C  2.379949 -0.983186 1.230542
C  2.420458 0.508124 1.046416
C  1.241892 1.310526 1.046616
C  1.375079 2.709219 0.814153
C  -4.28275 -1.497231 -1.103784
C  2.130463 -1.424174 -1.249882
C  3.647425 1.104001 0.881562
C  -0.060103 0.800772 1.278952
C  2.952873 -3.181954 0.303664
C  2.656135 3.270716 0.617855
C  3.773255 2.486013 0.661216
C  0.220857 3.527525 0.786529
C  -4.591005 -1.755002 0.376398
C  -4.685144 -2.71788 -1.939018
C  -5.044361 -0.257809 -1.58475
C  0.683825 -1.760276 -1.177641
C  -1.155944 1.61866 1.253274
C  -1.020061 2.996601 0.995713
C  -2.843222 -1.270755 -1.245799
C  -0.258569 -0.839168 -1.394271
C  -1.651862 -1.099885 -1.335734
H  3.037137 -1.286048 2.045239
H  1.390865 -1.372559 1.452273
H  2.284359 -0.368658 -1.468211
H  2.636994 -2.003003 -2.024142
H  4.549115 0.501715 0.922211
H  -0.210712 -0.248824 1.486037
H  3.34012 -3.691337 -0.574246
H  1.967523 -3.564117 0.552746
H  3.623742 -3.339503 1.143782
H  2.739299 4.336715 0.442891
H  4.755768 2.919237 0.528233
H  0.340615 4.587849 0.598444
H  -4.056733 -2.630381 0.748058
H  -5.660074 -1.93144 0.509127
H  -4.312641 -0.900726 0.995489
H  -4.468883 -2.566134 -2.99724
H  -4.158547 -3.615307 -1.611236
H  -5.756538 -2.90077 -1.837787
H  -4.773358 0.626037 -1.005358
H  -4.842743 -0.048052 -2.635996
H  -6.118806 -0.415326 -1.473707
H  0.402381 -2.788799 -0.980078
H  -2.138358 1.200535 1.431689
H  -1.89746 3.629661 0.972362
H  0.031072 0.184703 -1.6126
H  3.834157 -1.418154 -0.150688
elementType: N C H
totalener: -870.50382551 hartree
nucrepener: 1726.66520535 hartree
electener: -2597.16903086 hartree
oneelecener: -4585.09691524 hartree
twoeener: 1987.92788437 hartree
cpcmener: -0.09975608 hartree
kineticenergy: 866.21072556 hartree
xcener: -89.070795517029 hartree
chargesum: 1.0000000
charge: 0.206890 -0.112889 0.035203 -0.035798 -0.041016 0.059403 -0.110048 -0.148905 -0.257343 -0.191098 -0.115489 -0.147499 -0.076697 -0.289006 -0.286521 -0.284418 -0.121542 -0.103265 -0.166777 -0.261091 -0.234154 0.238184 0.161029 0.147796 0.143563 0.155419 0.138264 0.147217 0.140404 0.133489 0.139052 0.144878 0.159746 0.142839 0.101480 0.099848 0.098624 0.102193 0.100424 0.098461 0.098797 0.101831 0.098485 0.144261 0.164616 0.158355 0.144469 0.178336
qa: 0.2069 -0.1129 0.0352 -0.0358 -0.0410 0.0594 -0.1100 -0.1489 -0.2573 -0.1911 -0.1155 -0.1475 -0.0767 -0.2890 -0.2865 -0.2844 -0.1215 -0.1033 -0.1668 -0.2611 -0.2342 0.2382 0.1610 0.1478 0.1436 0.1554 0.1383 0.1472 0.1404 0.1335 0.1391 0.1449 0.1597 0.1428 0.1015 0.0998 0.0986 0.1022 0.1004 0.0985 0.0988 0.1018 0.0985 0.1443 0.1646 0.1584 0.1445 0.1783
va: 3.6420 3.8145 3.5213 3.7021 3.9147 4.0362 3.9178 3.9302 3.9031 3.8669 3.9259 3.9074 3.8705 3.8947 3.8913 3.8910 3.8071 3.8651 3.9501 4.0714 4.0035 3.6167 0.9920 0.9962 0.9968 0.9908 1.0041 1.0089 0.9944 0.9953 0.9955 1.0040 0.9905 1.0046 1.0053 1.0036 1.0072 1.0059 1.0058 1.0032 1.0065 1.0059 1.0034 1.0069 0.9888 0.9910 0.9910 0.9916
dispersion: -0.023864216 hartree
energy: -870.527689727738 hartree
dipole: -12.72501 17.31053 4.58552 -16.15047 13.20525 -2.94521 -4.16790 4.29922 0.13132
magnitude: 5.45147 au
magnitude: 13.85653 debye
