program: Orca
programVersion: 5.0.2
elementType: N C C C C C C C C C C C C C C C C C C C C C H H H H H H H H H H H H H H H H H H H H H H H H H H
charge: 1
multiplicity: 1
keywords: wb97x-d3
keywords: def2-TZVPP
keywords: def2/J RIJCOSX
keywords: DEFGRID2
keywords: scfconv7
keywords: smallprint printgap noloewdin
keywords: NOSOSCF
formula: C21H26N
InChI: InChI=1/C21H26N/c1-21(2,3)15-8-5-9-16-22(4)17-19-13-10-12-18-11-6-7-14-20(18)19/h5-7,9-14,22H,16-17H2,1-4H3
48 atoms
N  1.452419 -0.658296 -1.102168
C  1.439888 -0.174518 0.319375
C  1.34413 1.321773 0.399148
C  2.46706 2.156255 0.670652
C  2.265645 3.564361 0.725857
C  -5.007085 -3.219847 0.029353
C  1.200601 -2.13957 -1.200159
C  0.106314 1.885992 0.206392
C  3.776396 1.662802 0.893611
C  2.693375 -0.285991 -1.821414
C  0.975796 4.09895 0.508169
C  -0.084852 3.277412 0.251992
C  3.361548 4.415651 0.999714
C  -5.378851 -2.13584 1.048618
C  -5.032429 -4.597557 0.701355
C  -5.992853 -3.192127 -1.143006
C  -0.131382 -2.510522 -0.637396
C  4.815806 2.512298 1.157846
C  4.610662 3.904536 1.212109
C  -3.656254 -2.957769 -0.471249
C  -1.244835 -2.455081 -1.376017
C  -2.53951 -2.741133 -0.874466
H  2.319019 -0.594876 0.803061
H  0.563607 -0.615507 0.791095
H  1.266814 -2.387121 -2.258919
H  2.017951 -2.633436 -0.676232
H  -0.747978 1.244148 0.019352
H  3.973059 0.599663 0.861638
H  3.542021 -0.760058 -1.334767
H  2.810984 0.793508 -1.812296
H  2.618777 -0.629036 -2.849859
H  0.840743 5.173011 0.552468
H  -1.073324 3.687123 0.092282
H  3.191251 5.48486 1.039326
H  -6.381847 -2.321707 1.436977
H  -5.3737 -1.143865 0.595017
H  -4.687629 -2.126829 1.892302
H  -4.337193 -4.645349 1.540446
H  -6.034143 -4.804927 1.082203
H  -4.769892 -5.388659 -0.001982
H  -5.749037 -3.952255 -1.886195
H  -7.004869 -3.385679 -0.782766
H  -5.99303 -2.220922 -1.639511
H  -0.180457 -2.813135 0.402152
H  5.806164 2.110457 1.328619
H  5.442517 4.563544 1.423326
H  -1.18375 -2.164558 -2.422723
H  0.673215 -0.199085 -1.584195
elementType: N C H
totalener: -870.50544022 hartree
nucrepener: 1627.52887058 hartree
electener: -2498.03431080 hartree
oneelecener: -4386.42498710 hartree
twoeener: 1888.39067630 hartree
cpcmener: -0.09745801 hartree
kineticenergy: 866.20302240 hartree
xcener: -89.064234406443 hartree
chargesum: 1.0000000
charge: 0.213329 -0.141187 0.110731 -0.108627 -0.030701 0.054920 -0.071281 -0.163822 -0.219729 -0.209419 -0.124776 -0.152274 -0.082835 -0.287223 -0.286114 -0.287653 -0.168500 -0.139559 -0.148368 -0.255206 -0.214892 0.240684 0.157039 0.165670 0.140903 0.145455 0.151789 0.141747 0.140641 0.143965 0.144642 0.145503 0.160066 0.143442 0.099329 0.101490 0.100913 0.100326 0.098800 0.102423 0.101075 0.098288 0.100311 0.151128 0.157844 0.159862 0.144992 0.174863
qa: 0.2133 -0.1412 0.1107 -0.1086 -0.0307 0.0549 -0.0713 -0.1638 -0.2197 -0.2094 -0.1248 -0.1523 -0.0828 -0.2872 -0.2861 -0.2877 -0.1685 -0.1396 -0.1484 -0.2552 -0.2149 0.2407 0.1570 0.1657 0.1409 0.1455 0.1518 0.1417 0.1406 0.1440 0.1446 0.1455 0.1601 0.1434 0.0993 0.1015 0.1009 0.1003 0.0988 0.1024 0.1011 0.0983 0.1003 0.1511 0.1578 0.1599 0.1450 0.1749
va: 3.6517 3.8277 3.4155 3.8282 3.8858 4.0389 3.8700 3.9438 3.9346 3.8656 3.9375 3.9223 3.8707 3.8930 3.8934 3.8950 3.8696 3.9325 3.9159 4.0726 3.9920 3.6623 1.0024 0.9898 0.9991 1.0002 0.9994 1.0088 0.9928 0.9889 0.9980 1.0037 0.9909 1.0052 1.0033 1.0055 1.0057 1.0061 1.0032 1.0054 1.0057 1.0035 1.0058 1.0007 0.9922 0.9897 0.9991 0.9969
dispersion: -0.020609600 hartree
energy: -870.526049819787 hartree
dipole: -17.43683 19.70647 2.26965 -17.96850 16.91343 -1.05507 -3.21651 1.45466 -1.76185
magnitude: 3.06082 au
magnitude: 7.77997 debye
