program: Orca
programVersion: 5.0.2
elementType: N C C C C C C C C C C C C C C C C C C C C C H H H H H H H H H H H H H H H H H H H H H H H H H H
charge: 1
multiplicity: 1
keywords: wb97x-d3
keywords: def2-TZVPP
keywords: def2/J RIJCOSX
keywords: DEFGRID2
keywords: scfconv7
keywords: smallprint printgap noloewdin
keywords: NOSOSCF
formula: C21H26N
InChI: InChI=1/C21H26N/c1-21(2,3)15-8-5-9-16-22(4)17-19-13-10-12-18-11-6-7-14-20(18)19/h5-7,9-14,22H,16-17H2,1-4H3
48 atoms
N  1.961479 -1.197398 -0.615984
C  3.062766 -0.173242 -0.581529
C  2.518372 1.226497 -0.601036
C  2.46293 2.047944 0.563612
C  1.888666 3.345479 0.450054
C  -4.958289 -2.964611 -0.671062
C  1.078415 -1.141115 0.599118
C  2.039161 1.706595 -1.795712
C  2.940001 1.642049 1.834904
C  2.51153 -2.555259 -0.846163
C  1.393683 3.788152 -0.797212
C  1.468146 2.986586 -1.900495
C  1.813822 4.178449 1.590876
C  -6.049854 -2.018418 -0.15843
C  -5.072328 -4.325168 0.024058
C  -5.094204 -3.141516 -2.188417
C  -0.188349 -1.897615 0.387661
C  2.853496 2.471304 2.919707
C  2.284555 3.754034 2.801047
C  -3.647835 -2.380198 -0.379433
C  -1.32445 -1.257576 0.093501
C  -2.567887 -1.894695 -0.146109
H  3.665364 -0.355869 -1.470263
H  3.679487 -0.402294 0.284312
H  1.665691 -1.53341 1.429918
H  0.859242 -0.092982 0.790381
H  2.099882 1.086551 -2.683601
H  3.38272 0.664219 1.967579
H  3.085375 -2.552303 -1.768843
H  1.697272 -3.268575 -0.93381
H  3.152406 -2.823228 -0.009864
H  0.956393 4.777047 -0.864786
H  1.094343 3.329085 -2.856208
H  1.374164 5.163179 1.487142
H  -7.035274 -2.434207 -0.376741
H  -5.984205 -1.039981 -0.636038
H  -5.977556 -1.873976 0.920278
H  -6.046723 -4.769629 -0.187313
H  -4.305116 -5.017113 -0.325747
H  -4.974339 -4.229654 1.106147
H  -6.070109 -3.56939 -2.425405
H  -5.009908 -2.187452 -2.710351
H  -4.32905 -3.811952 -2.582088
H  -0.171957 -2.977541 0.477207
H  3.225827 2.137612 3.879605
H  2.223059 4.398287 3.668313
H  -1.322075 -0.172071 0.026681
H  1.368787 -0.971878 -1.4208
elementType: N C H
totalener: -870.50591350 hartree
nucrepener: 1639.43674095 hartree
electener: -2509.94265445 hartree
oneelecener: -4410.36611220 hartree
twoeener: 1900.42345775 hartree
cpcmener: -0.09736439 hartree
kineticenergy: 866.20402125 hartree
xcener: -89.064379842124 hartree
chargesum: 1.0000000
charge: 0.199038 -0.092547 0.068765 -0.093277 -0.022933 0.058594 -0.084773 -0.181309 -0.208175 -0.182339 -0.127975 -0.135569 -0.086501 -0.288507 -0.287622 -0.287422 -0.189841 -0.135720 -0.146040 -0.250779 -0.183401 0.225395 0.153204 0.152157 0.153509 0.139138 0.146665 0.143626 0.136356 0.133987 0.139392 0.145293 0.159798 0.143454 0.098478 0.101216 0.101631 0.098611 0.099983 0.101993 0.099039 0.101767 0.101215 0.149802 0.157244 0.160329 0.140335 0.174716
qa: 0.1990 -0.0925 0.0688 -0.0933 -0.0229 0.0586 -0.0848 -0.1813 -0.2082 -0.1823 -0.1280 -0.1356 -0.0865 -0.2885 -0.2876 -0.2874 -0.1898 -0.1357 -0.1460 -0.2508 -0.1834 0.2254 0.1532 0.1522 0.1535 0.1391 0.1467 0.1436 0.1364 0.1340 0.1394 0.1453 0.1598 0.1435 0.0985 0.1012 0.1016 0.0986 0.1000 0.1020 0.0990 0.1018 0.1012 0.1498 0.1572 0.1603 0.1403 0.1747
va: 3.6656 3.8005 3.4862 3.7803 3.8796 4.0354 3.8920 3.9631 3.9178 3.8631 3.9389 3.9025 3.8769 3.8951 3.8939 3.8963 3.9055 3.9256 3.9149 4.0854 4.0046 3.6894 0.9956 0.9993 0.9995 1.0034 1.0008 1.0058 0.9960 0.9963 0.9945 1.0041 0.9902 1.0052 1.0031 1.0055 1.0057 1.0034 1.0060 1.0052 1.0032 1.0054 1.0054 1.0031 0.9923 0.9894 0.9998 0.9966
dispersion: -0.020659542 hartree
energy: -870.526573042928 hartree
dipole: -16.80655 19.88658 3.08003 -21.25233 19.24869 -2.00364 -4.93840 3.87146 -1.06694
magnitude: 3.82616 au
magnitude: 9.72533 debye
