program: Orca
programVersion: 5.0.2
elementType: N C C C C C C C C C C C C C C C C C C C C C H H H H H H H H H H H H H H H H H H H H H H H H H H
charge: 1
multiplicity: 1
keywords: wb97x-d3
keywords: def2-TZVPP
keywords: def2/J RIJCOSX
keywords: DEFGRID2
keywords: scfconv7
keywords: smallprint printgap noloewdin
keywords: NOSOSCF
formula: C21H26N
InChI: InChI=1/C21H26N/c1-21(2,3)15-8-5-9-16-22(4)17-19-13-10-12-18-11-6-7-14-20(18)19/h5-7,9-14,22H,16-17H2,1-4H3
48 atoms
N  1.894006 -1.243507 -0.334167
C  3.049587 -0.280395 -0.356722
C  2.609083 1.132512 -0.607953
C  2.51343 2.101695 0.433444
C  2.064423 3.410604 0.102203
C  -5.011173 -3.08278 -0.543027
C  0.912582 -0.951076 0.766359
C  2.286162 1.483462 -1.895727
C  2.834785 1.83163 1.786414
C  2.385795 -2.641652 -0.285105
C  1.727756 3.719394 -1.234813
C  1.837327 2.776059 -2.216381
C  1.955564 4.388831 1.118156
C  -6.02444 -2.040974 -1.029985
C  -5.51726 -3.744486 0.743682
C  -4.798932 -4.147133 -1.625847
C  -0.339299 -1.745534 0.612151
C  2.717777 2.799261 2.746667
C  2.273924 4.093052 2.413085
C  -3.732637 -2.419337 -0.277775
C  -1.446562 -1.191041 0.109653
C  -2.672566 -1.876208 -0.083278
H  3.699603 -0.618398 -1.162924
H  3.589062 -0.415745 0.577826
H  1.425442 -1.164439 1.704397
H  0.690382 0.112675 0.723149
H  2.380371 0.749522 -2.688666
H  3.182452 0.850531 2.080451
H  3.062602 -2.807201 -1.11844
H  1.548005 -3.327404 -0.364669
H  2.908037 -2.799343 0.655006
H  1.383636 4.719309 -1.470116
H  1.586581 3.016438 -3.240905
H  1.612099 5.380671 0.850127
H  -5.685621 -1.554149 -1.945342
H  -6.194411 -1.268822 -0.278674
H  -6.981282 -2.522329 -1.240044
H  -6.471574 -4.239365 0.554278
H  -4.815899 -4.49575 1.108977
H  -5.670664 -3.010591 1.535793
H  -4.433466 -3.704623 -2.553325
H  -4.082782 -4.904564 -1.304923
H  -5.744436 -4.647954 -1.842172
H  -0.3361 -2.783609 0.923018
H  2.971635 2.568765 3.773127
H  2.186056 4.847621 3.1837
H  -1.432938 -0.142809 -0.177439
H  1.389379 -1.130157 -1.218732
elementType: N C H
totalener: -870.50615332 hartree
nucrepener: 1634.65665656 hartree
electener: -2505.16280988 hartree
oneelecener: -4400.80340730 hartree
twoeener: 1895.64059741 hartree
cpcmener: -0.09769208 hartree
kineticenergy: 866.21362896 hartree
xcener: -89.066404358770 hartree
chargesum: 1.0000000
charge: 0.200110 -0.090184 0.054463 -0.088842 -0.023225 0.058308 -0.079272 -0.174565 -0.205578 -0.183876 -0.125591 -0.136404 -0.086806 -0.289421 -0.285789 -0.287806 -0.196961 -0.137556 -0.145659 -0.252004 -0.181063 0.222984 0.154008 0.153997 0.152941 0.140287 0.145363 0.143146 0.136260 0.134767 0.139674 0.144953 0.159596 0.142636 0.101290 0.101639 0.098321 0.099095 0.100357 0.102166 0.101702 0.100298 0.099004 0.151381 0.157198 0.159604 0.140979 0.174078
qa: 0.2001 -0.0902 0.0545 -0.0888 -0.0232 0.0583 -0.0793 -0.1746 -0.2056 -0.1839 -0.1256 -0.1364 -0.0868 -0.2894 -0.2858 -0.2878 -0.1970 -0.1376 -0.1457 -0.2520 -0.1811 0.2230 0.1540 0.1540 0.1529 0.1403 0.1454 0.1431 0.1363 0.1348 0.1397 0.1450 0.1596 0.1426 0.1013 0.1016 0.0983 0.0991 0.1004 0.1022 0.1017 0.1003 0.0990 0.1514 0.1572 0.1596 0.1410 0.1741
va: 3.6716 3.7829 3.4920 3.7750 3.8826 4.0370 3.8834 3.9661 3.9173 3.8640 3.9390 3.9025 3.8762 3.8938 3.8921 3.8951 3.9225 3.9264 3.9119 4.0855 4.0066 3.6976 0.9961 0.9987 0.9984 1.0027 1.0014 1.0051 0.9960 0.9959 0.9943 1.0042 0.9902 1.0053 1.0055 1.0057 1.0033 1.0031 1.0061 1.0056 1.0054 1.0061 1.0034 1.0015 0.9923 0.9895 0.9999 0.9965
dispersion: -0.020577761 hartree
energy: -870.526731078534 hartree
dipole: -17.40058 20.38609 2.98550 -22.07004 19.95077 -2.11928 -2.79596 2.20104 -0.59492
magnitude: 3.70924 au
magnitude: 9.42815 debye
