program: Orca
programVersion: 5.0.2
elementType: N C C C C C C C C C C C C C C C C C C C C C H H H H H H H H H H H H H H H H H H H H H H H H H H
charge: 1
multiplicity: 1
keywords: wb97x-d3
keywords: def2-TZVPP
keywords: def2/J RIJCOSX
keywords: DEFGRID2
keywords: scfconv7
keywords: smallprint printgap noloewdin
keywords: NOSOSCF
formula: C21H26N
InChI: InChI=1/C21H26N/c1-21(2,3)15-8-5-9-16-22(4)17-19-13-10-12-18-11-6-7-14-20(18)19/h5-7,9-14,22H,16-17H2,1-4H3
48 atoms
N  2.388861 -1.288753 -0.315787
C  1.920614 -0.779932 1.022327
C  2.281634 0.654868 1.253652
C  1.517002 1.711039 0.67288
C  1.91984 3.0532 0.910638
C  -4.687905 -1.772325 -1.028282
C  1.674698 -2.557629 -0.702567
C  3.355566 0.953431 2.053858
C  0.365162 1.49149 -0.122098
C  3.860093 -1.470527 -0.356254
C  3.038976 3.311305 1.735817
C  3.734945 2.284829 2.306407
C  1.187578 4.113609 0.328681
C  -5.286052 -2.730812 -2.064195
C  -4.751485 -0.33298 -1.552088
C  -5.460206 -1.882269 0.290572
C  0.255457 -2.28137 -1.052986
C  -0.327001 2.538986 -0.666972
C  0.09124 3.865151 -0.449056
C  -3.287051 -2.130548 -0.791405
C  -0.771129 -2.700727 -0.308136
C  -2.12779 -2.405606 -0.59841
H  2.379939 -1.426693 1.768896
H  0.844583 -0.938372 1.067865
H  2.215358 -2.964506 -1.557215
H  1.773904 -3.248687 0.134429
H  3.922212 0.148354 2.506319
H  0.00276 0.487581 -0.301526
H  4.151246 -1.75395 -1.36382
H  4.138291 -2.251846 0.346361
H  4.348319 -0.53822 -0.088982
H  3.329988 4.339162 1.915826
H  4.583176 2.485659 2.946833
H  1.508829 5.131343 0.514327
H  -4.756221 -2.67114 -3.015715
H  -6.331549 -2.473788 -2.244442
H  -5.248777 -3.764727 -1.719085
H  -4.331307 0.371273 -0.832747
H  -4.205808 -0.225367 -2.490307
H  -5.78971 -0.048453 -1.73251
H  -5.050384 -1.214309 1.049275
H  -6.505393 -1.609838 0.133024
H  -5.43356 -2.899089 0.684174
H  0.07717 -1.703611 -1.954282
H  -1.20666 2.344796 -1.267153
H  -0.463605 4.683482 -0.888388
H  -0.580673 -3.287029 0.586801
H  2.156463 -0.586518 -1.02488
elementType: N C H
totalener: -870.50803576 hartree
nucrepener: 1671.66324518 hartree
electener: -2542.17128094 hartree
oneelecener: -4474.65512584 hartree
twoeener: 1932.48384489 hartree
cpcmener: -0.09713303 hartree
kineticenergy: 866.20048287 hartree
xcener: -89.064515811565 hartree
chargesum: 1.0000000
charge: 0.207162 -0.147655 0.049881 -0.073403 -0.041179 0.061922 -0.056340 -0.153248 -0.207237 -0.195998 -0.124311 -0.127624 -0.090592 -0.285862 -0.291757 -0.287675 -0.171673 -0.153987 -0.147466 -0.258734 -0.219778 0.243690 0.150549 0.182488 0.141158 0.137672 0.147054 0.147606 0.139266 0.139635 0.141218 0.145456 0.159188 0.144032 0.101173 0.098682 0.102009 0.099776 0.101187 0.099469 0.101091 0.098171 0.101537 0.150511 0.155998 0.160057 0.147749 0.179133
qa: 0.2072 -0.1477 0.0499 -0.0734 -0.0412 0.0619 -0.0563 -0.1532 -0.2072 -0.1960 -0.1243 -0.1276 -0.0906 -0.2859 -0.2918 -0.2877 -0.1717 -0.1540 -0.1475 -0.2587 -0.2198 0.2437 0.1505 0.1825 0.1412 0.1377 0.1471 0.1476 0.1393 0.1396 0.1412 0.1455 0.1592 0.1440 0.1012 0.0987 0.1020 0.0998 0.1012 0.0995 0.1011 0.0982 0.1015 0.1505 0.1560 0.1601 0.1477 0.1791
va: 3.6180 3.8099 3.4264 3.9100 3.9046 4.0306 3.8761 3.9246 3.9244 3.8651 3.9387 3.8999 3.8772 3.8933 3.8966 3.8954 3.8590 3.9610 3.9110 4.0736 3.9971 3.6537 1.0064 0.9715 0.9949 1.0019 1.0008 1.0020 0.9963 0.9938 0.9933 1.0037 0.9904 1.0048 1.0056 1.0032 1.0056 1.0055 1.0056 1.0042 1.0054 1.0034 1.0057 1.0051 0.9942 0.9898 0.9966 0.9921
dispersion: -0.021578909 hartree
energy: -870.529614669449 hartree
dipole: -13.63928 17.50860 3.86932 -13.06818 11.00953 -2.05865 -6.34766 5.90119 -0.44647
magnitude: 4.40557 au
magnitude: 11.19806 debye
