program: Orca
programVersion: 5.0.2
elementType: N C C C C C C C C C C C C C C C C C C C C C H H H H H H H H H H H H H H H H H H H H H H H H H H
charge: 1
multiplicity: 1
keywords: wb97x-d3
keywords: def2-TZVPP
keywords: def2/J RIJCOSX
keywords: DEFGRID2
keywords: scfconv7
keywords: smallprint printgap noloewdin
keywords: NOSOSCF
formula: C21H26N
InChI: InChI=1/C21H26N/c1-21(2,3)15-8-5-9-16-22(4)17-19-13-10-12-18-11-6-7-14-20(18)19/h5-7,9-14,22H,16-17H2,1-4H3
48 atoms
N  1.345204 -0.563899 -1.10624
C  1.403165 -0.116476 0.326031
C  1.379312 1.37969 0.448754
C  2.553121 2.154725 0.678851
C  2.423192 3.568767 0.773661
C  -5.100298 -3.321612 -0.003575
C  1.072557 -2.03959 -1.225842
C  0.161552 2.005069 0.335672
C  3.84668 1.59493 0.820802
C  2.55812 -0.191242 -1.871692
C  1.150486 4.167599 0.637392
C  0.039837 3.402405 0.422046
C  3.572548 4.360924 1.002698
C  -5.696738 -2.076679 0.664027
C  -4.990763 -4.45735 1.019779
C  -5.98298 -3.758177 -1.177671
C  -0.251239 -2.409728 -0.645151
C  4.939177 2.387882 1.043532
C  4.805078 3.786611 1.135318
C  -3.760815 -3.00089 -0.501033
C  -1.361917 -2.413847 -1.388938
C  -2.650382 -2.733099 -0.890836
H  2.279502 -0.586897 0.766766
H  0.525184 -0.532101 0.816959
H  1.11216 -2.269047 -2.289949
H  1.896264 -2.55202 -0.729795
H  -0.730975 1.408614 0.180874
H  3.988142 0.524624 0.758085
H  2.434052 -0.512836 -2.90218
H  3.421023 -0.685251 -1.432936
H  2.689527 0.886229 -1.848052
H  1.069208 5.245349 0.711001
H  -0.934983 3.861383 0.325083
H  3.457127 5.435935 1.071493
H  -6.693798 -2.304036 1.045599
H  -5.787549 -1.250171 -0.041907
H  -5.084803 -1.741295 1.502346
H  -4.368524 -4.170034 1.868285
H  -5.981829 -4.710965 1.400258
H  -4.562316 -5.355504 0.573292
H  -6.076282 -2.966785 -1.922489
H  -5.578565 -4.642311 -1.672081
H  -6.984356 -4.002372 -0.818597
H  -0.295206 -2.674869 0.4043
H  5.916527 1.935947 1.152107
H  5.678256 4.400855 1.311693
H  -1.299989 -2.166954 -2.446202
H  0.550977 -0.084921 -1.542199
elementType: N C H
totalener: -870.50596497 hartree
nucrepener: 1621.79703626 hartree
electener: -2492.30300123 hartree
oneelecener: -4374.97786530 hartree
twoeener: 1882.67486407 hartree
cpcmener: -0.09761887 hartree
kineticenergy: 866.21047402 hartree
xcener: -89.065810150162 hartree
chargesum: 1.0000000
charge: 0.217293 -0.132602 0.100810 -0.109983 -0.029532 0.056560 -0.070871 -0.159910 -0.215411 -0.213241 -0.122979 -0.151688 -0.084576 -0.286864 -0.287311 -0.287418 -0.172638 -0.140851 -0.147457 -0.255890 -0.205733 0.235249 0.157244 0.161321 0.138398 0.145964 0.150111 0.142658 0.144690 0.141428 0.144635 0.145288 0.159424 0.143390 0.099439 0.101605 0.101447 0.100107 0.098335 0.102081 0.100497 0.101887 0.098354 0.151476 0.157272 0.159827 0.144055 0.174108
qa: 0.2173 -0.1326 0.1008 -0.1100 -0.0295 0.0566 -0.0709 -0.1599 -0.2154 -0.2132 -0.1230 -0.1517 -0.0846 -0.2869 -0.2873 -0.2874 -0.1726 -0.1409 -0.1475 -0.2559 -0.2057 0.2352 0.1572 0.1613 0.1384 0.1460 0.1501 0.1427 0.1447 0.1414 0.1446 0.1453 0.1594 0.1434 0.0994 0.1016 0.1014 0.1001 0.0983 0.1021 0.1005 0.1019 0.0984 0.1515 0.1573 0.1598 0.1441 0.1741
va: 3.6514 3.8239 3.4351 3.8249 3.8834 4.0360 3.8702 3.9423 3.9305 3.8669 3.9345 3.9196 3.8732 3.8947 3.8941 3.8942 3.8720 3.9351 3.9146 4.0773 3.9971 3.6717 1.0011 0.9924 0.9999 1.0000 1.0002 1.0077 0.9982 0.9921 0.9883 1.0038 0.9909 1.0053 1.0031 1.0055 1.0053 1.0062 1.0035 1.0053 1.0058 1.0054 1.0032 1.0005 0.9924 0.9896 0.9994 0.9972
dispersion: -0.020493938 hartree
energy: -870.526458910644 hartree
dipole: -18.21054 20.31427 2.10374 -18.30140 17.37052 -0.93088 -3.53033 1.75036 -1.77996
magnitude: 2.90870 au
magnitude: 7.39332 debye
