program: Orca
programVersion: 5.0.2
elementType: N C C C C C C C C C C C C C C C C C C C C C H H H H H H H H H H H H H H H H H H H H H H H H H H
charge: 1
multiplicity: 1
keywords: wb97x-d3
keywords: def2-TZVPP
keywords: def2/J RIJCOSX
keywords: DEFGRID2
keywords: scfconv7
keywords: smallprint printgap noloewdin
keywords: NOSOSCF
formula: C21H26N
InChI: InChI=1/C21H26N/c1-21(2,3)15-8-5-9-16-22(4)17-19-13-10-12-18-11-6-7-14-20(18)19/h5-7,9-14,22H,16-17H2,1-4H3
48 atoms
N  2.243143 -1.620204 0.427196
C  2.080481 -0.57606 1.495879
C  2.597295 0.76814 1.068052
C  1.740327 1.887086 0.850013
C  2.322053 3.111299 0.413922
C  -4.790328 -2.211714 -1.038103
C  1.552771 -1.311105 -0.874442
C  3.95265 0.907235 0.892917
C  0.33924 1.861261 1.061644
C  1.881265 -2.959878 0.951165
C  3.71899 3.196826 0.222098
C  4.521231 2.11856 0.46431
C  1.495734 4.236667 0.184904
C  -5.225778 -1.019276 -0.178981
C  -5.260916 -3.520139 -0.392766
C  -5.383026 -2.085151 -2.446453
C  0.069862 -1.278179 -0.762726
C  -0.433174 2.967042 0.83373
C  0.146298 4.16927 0.385511
C  -3.328373 -2.22545 -1.130152
C  -0.705663 -2.248586 -1.25529
C  -2.122867 -2.224256 -1.188343
H  2.647835 -0.944994 2.350017
H  1.032712 -0.577625 1.783291
H  1.947338 -0.354886 -1.217739
H  1.881185 -2.080712 -1.571998
H  4.608707 0.065878 1.090194
H  -0.144699 0.964907 1.423781
H  0.846439 -2.95579 1.280315
H  2.53332 -3.191972 1.788609
H  2.01872 -3.698036 0.165701
H  4.145171 4.136011 -0.109234
H  5.592782 2.189136 0.333377
H  1.955566 5.158991 -0.148893
H  -4.813643 -1.082869 0.82896
H  -6.313996 -0.997603 -0.096147
H  -4.903933 -0.073809 -0.617598
H  -6.349766 -3.524484 -0.315752
H  -4.962433 -4.386168 -0.984869
H  -4.85293 -3.639534 0.611768
H  -5.062256 -1.162921 -2.932616
H  -5.088583 -2.922669 -3.079983
H  -6.473002 -2.073987 -2.389633
H  -0.386652 -0.41267 -0.299164
H  -1.500548 2.918115 1.005931
H  -0.477608 5.03574 0.210001
H  -0.253741 -3.109982 -1.739981
H  3.239978 -1.658235 0.198926
elementType: N C H
totalener: -870.50456064 hartree
nucrepener: 1664.04970594 hartree
electener: -2534.55426658 hartree
oneelecener: -4459.66702165 hartree
twoeener: 1925.11275507 hartree
cpcmener: -0.09905058 hartree
kineticenergy: 866.20634186 hartree
xcener: -89.067200656447 hartree
chargesum: 1.0000000
charge: 0.219158 -0.104736 0.001726 -0.003730 -0.025196 0.062059 -0.100400 -0.151672 -0.267846 -0.210841 -0.116109 -0.148830 -0.079981 -0.290724 -0.288189 -0.287617 -0.167006 -0.127633 -0.154336 -0.260639 -0.197071 0.232038 0.158735 0.150447 0.155981 0.153346 0.141363 0.152335 0.138199 0.144826 0.142216 0.144978 0.159663 0.143312 0.100367 0.097990 0.101419 0.098393 0.102012 0.101283 0.102377 0.101644 0.098579 0.143517 0.158378 0.160084 0.138248 0.177878
qa: 0.2192 -0.1047 0.0017 -0.0037 -0.0252 0.0621 -0.1004 -0.1517 -0.2678 -0.2108 -0.1161 -0.1488 -0.0800 -0.2907 -0.2882 -0.2876 -0.1670 -0.1276 -0.1543 -0.2606 -0.1971 0.2320 0.1587 0.1504 0.1560 0.1533 0.1414 0.1523 0.1382 0.1448 0.1422 0.1450 0.1597 0.1433 0.1004 0.0980 0.1014 0.0984 0.1020 0.1013 0.1024 0.1016 0.0986 0.1435 0.1584 0.1601 0.1382 0.1779
va: 3.6199 3.7984 3.5327 3.7337 3.8895 4.0277 3.9071 3.9402 3.9396 3.8797 3.9269 3.9119 3.8681 3.8967 3.8964 3.8955 3.8331 3.9155 3.9237 4.0852 4.0217 3.6630 0.9948 0.9941 0.9911 0.9957 1.0023 1.0017 0.9901 0.9961 0.9931 1.0042 0.9906 1.0050 1.0054 1.0038 1.0054 1.0034 1.0055 1.0052 1.0050 1.0055 1.0032 1.0171 0.9923 0.9897 1.0038 0.9927
dispersion: -0.021472962 hartree
energy: -870.526033603444 hartree
dipole: -18.11731 21.64221 3.52490 -17.38465 14.70548 -2.67918 -2.13059 2.91523 0.78464
magnitude: 4.49651 au
magnitude: 11.42921 debye
