program: Orca
programVersion: 5.0.2
elementType: N C C C C C C C C C C C C C C C C C C C C C H H H H H H H H H H H H H H H H H H H H H H H H H H
charge: 1
multiplicity: 1
keywords: wb97x-d3
keywords: def2-TZVPP
keywords: def2/J RIJCOSX
keywords: DEFGRID2
keywords: scfconv7
keywords: smallprint printgap noloewdin
keywords: NOSOSCF
formula: C21H26N
InChI: InChI=1/C21H26N/c1-21(2,3)15-8-5-9-16-22(4)17-19-13-10-12-18-11-6-7-14-20(18)19/h5-7,9-14,22H,16-17H2,1-4H3
48 atoms
N  2.136709 -1.60805 0.579874
C  1.988271 -0.493667 1.576428
C  2.593836 0.78955 1.081512
C  1.812019 1.93561 0.752461
C  2.479952 3.087929 0.248191
C  -4.882616 -2.248334 -0.976742
C  1.467191 -1.361103 -0.74607
C  3.960146 0.837941 0.947407
C  0.405904 2.005994 0.915927
C  1.736553 -2.904188 1.178695
C  3.884871 3.078879 0.101223
C  4.613896 1.978641 0.452068
C  1.729724 4.237167 -0.094975
C  -5.407326 -3.681717 -1.113748
C  -5.422023 -1.383592 -2.122342
C  -5.319264 -1.659528 0.369565
C  -0.016993 -1.303751 -0.65463
C  -0.291215 3.134066 0.579301
C  0.373023 4.262336 0.061557
C  -3.419131 -2.26051 -1.036219
C  -0.794739 -2.28987 -1.111566
C  -2.212629 -2.257784 -1.070567
H  2.503964 -0.833675 2.474207
H  0.931933 -0.424525 1.819967
H  1.879476 -0.43011 -1.134521
H  1.792997 -2.171625 -1.396749
H  4.558256 -0.021842 1.230647
H  -0.141583 1.169209 1.327157
H  0.698131 -2.857686 1.492711
H  2.372272 -3.100723 2.037442
H  1.866019 -3.691609 0.441218
H  4.376272 3.963793 -0.284862
H  5.691357 1.9777 0.355292
H  2.25403 5.102451 -0.482394
H  -6.497816 -3.684893 -1.065811
H  -5.034987 -4.320755 -0.312054
H  -5.11139 -4.125046 -2.065355
H  -5.126465 -1.779866 -3.094577
H  -6.512796 -1.361023 -2.086426
H  -5.062012 -0.35646 -2.050864
H  -4.945569 -2.254561 1.203993
H  -4.958711 -0.637565 0.494146
H  -6.408963 -1.641563 0.431222
H  -0.468308 -0.41127 -0.238597
H  -1.364279 3.160838 0.717599
H  -0.192177 5.146586 -0.202462
H  -0.341496 -3.175704 -1.54881
H  3.134659 -1.683461 0.36642
elementType: N C H
totalener: -870.50470740 hartree
nucrepener: 1659.39239597 hartree
electener: -2529.89710337 hartree
oneelecener: -4450.33393637 hartree
twoeener: 1920.43683300 hartree
cpcmener: -0.09894694 hartree
kineticenergy: 866.20390456 hartree
xcener: -89.066518499501 hartree
chargesum: 1.0000000
charge: 0.216823 -0.100351 0.008377 -0.017270 -0.017508 0.056507 -0.099209 -0.156178 -0.258882 -0.210823 -0.118885 -0.148619 -0.081955 -0.287870 -0.285912 -0.288218 -0.170041 -0.131647 -0.152156 -0.260319 -0.196085 0.235850 0.157965 0.149233 0.155913 0.153239 0.141368 0.152222 0.138348 0.144682 0.142293 0.145039 0.159962 0.143464 0.098251 0.100904 0.101718 0.102159 0.098407 0.101275 0.101385 0.100741 0.098352 0.143165 0.158313 0.160138 0.138123 0.177715
qa: 0.2168 -0.1004 0.0084 -0.0173 -0.0175 0.0565 -0.0992 -0.1562 -0.2589 -0.2108 -0.1189 -0.1486 -0.0820 -0.2879 -0.2859 -0.2882 -0.1700 -0.1316 -0.1522 -0.2603 -0.1961 0.2358 0.1580 0.1492 0.1559 0.1532 0.1414 0.1522 0.1383 0.1447 0.1423 0.1450 0.1600 0.1435 0.0983 0.1009 0.1017 0.1022 0.0984 0.1013 0.1014 0.1007 0.0984 0.1432 0.1583 0.1601 0.1381 0.1777
va: 3.6219 3.8014 3.5302 3.7408 3.8733 4.0358 3.9035 3.9426 3.9367 3.8804 3.9269 3.9110 3.8700 3.8943 3.8938 3.8941 3.8400 3.9189 3.9207 4.0836 4.0180 3.6611 0.9948 0.9955 0.9911 0.9960 1.0022 1.0020 0.9898 0.9963 0.9930 1.0042 0.9905 1.0051 1.0035 1.0055 1.0055 1.0057 1.0032 1.0056 1.0055 1.0059 1.0036 1.0169 0.9923 0.9896 1.0036 0.9930
dispersion: -0.021363746 hartree
energy: -870.526071143416 hartree
dipole: -18.93628 22.28419 3.34791 -17.39314 14.74057 -2.65257 -1.35270 2.37141 1.01870
magnitude: 4.39117 au
magnitude: 11.16147 debye
