program: Orca
programVersion: 5.0.2
elementType: N C C C C C C C C C C C C C C C C C C C C C H H H H H H H H H H H H H H H H H H H H H H H H H H
charge: 1
multiplicity: 1
keywords: wb97x-d3
keywords: def2-TZVPP
keywords: def2/J RIJCOSX
keywords: DEFGRID2
keywords: scfconv7
keywords: smallprint printgap noloewdin
keywords: NOSOSCF
formula: C21H26N
InChI: InChI=1/C21H26N/c1-21(2,3)15-8-5-9-16-22(4)17-19-13-10-12-18-11-6-7-14-20(18)19/h5-7,9-14,22H,16-17H2,1-4H3
48 atoms
N  2.352946 -1.287745 -0.350181
C  2.054648 -0.899331 1.07276
C  2.334185 0.547205 1.343907
C  1.423084 1.563199 0.926915
C  1.744372 2.919989 1.20426
C  -4.567094 -1.648645 -1.198468
C  1.752517 -2.62032 -0.713424
C  3.478248 0.892474 2.017664
C  0.205475 1.289786 0.256753
C  3.806065 -1.264489 -0.641772
C  2.940324 3.228416 1.893068
C  3.787142 2.23669 2.297526
C  0.857213 3.942966 0.797225
C  -5.036194 -2.208423 0.148641
C  -5.299977 -2.357244 -2.342848
C  -4.839337 -0.140287 -1.259758
C  0.266665 -2.604002 -0.570325
C  -0.633787 2.302072 -0.124092
C  -0.30596 3.644546 0.143877
C  -3.12611 -1.870318 -1.336259
C  -0.52802 -2.169125 -1.553601
C  -1.934773 -2.039038 -1.431951
H  2.667113 -1.54552 1.700653
H  1.011736 -1.145674 1.263991
H  2.053436 -2.815118 -1.741953
H  2.219924 -3.362101 -0.067036
H  4.160106 0.115785 2.34299
H  -0.089624 0.270399 0.042383
H  4.305872 -1.992017 -0.006703
H  4.199525 -0.270707 -0.451113
H  3.957329 -1.516778 -1.68796
H  3.171306 4.266392 2.100577
H  4.697227 2.475106 2.831805
H  1.115267 4.972432 1.015257
H  -4.848448 -3.280399 0.222544
H  -6.109486 -2.04679 0.264126
H  -4.530834 -1.717928 0.981694
H  -4.986886 -1.974567 -3.315006
H  -5.118289 -3.432613 -2.326876
H  -6.375662 -2.197126 -2.24911
H  -4.320508 0.391121 -0.460464
H  -4.519164 0.284049 -2.212227
H  -5.908933 0.048233 -1.149629
H  -0.159007 -2.924188 0.373353
H  -1.561061 2.06668 -0.630868
H  -0.978928 4.435025 -0.161747
H  -0.093169 -1.868042 -2.50415
H  1.91233 -0.597013 -0.964615
elementType: N C H
totalener: -870.50674265 hartree
nucrepener: 1683.20698378 hartree
electener: -2553.71372643 hartree
oneelecener: -4497.64970186 hartree
twoeener: 1943.93597544 hartree
cpcmener: -0.09615358 hartree
kineticenergy: 866.19909647 hartree
xcener: -89.064539619722 hartree
chargesum: 1.0000000
charge: 0.201274 -0.131569 0.034040 -0.067955 -0.038517 0.072593 -0.075998 -0.151779 -0.192420 -0.201047 -0.125018 -0.123501 -0.087630 -0.288987 -0.288215 -0.295224 -0.152652 -0.151740 -0.151180 -0.255796 -0.232070 0.243317 0.150979 0.174709 0.142201 0.145793 0.145553 0.131659 0.140696 0.143751 0.141062 0.144455 0.160069 0.143019 0.102062 0.098530 0.099649 0.101385 0.102541 0.098749 0.098410 0.102955 0.102338 0.147521 0.157203 0.159534 0.146594 0.178656
qa: 0.2013 -0.1316 0.0340 -0.0680 -0.0385 0.0726 -0.0760 -0.1518 -0.1924 -0.2010 -0.1250 -0.1235 -0.0876 -0.2890 -0.2882 -0.2952 -0.1527 -0.1517 -0.1512 -0.2558 -0.2321 0.2433 0.1510 0.1747 0.1422 0.1458 0.1456 0.1317 0.1407 0.1438 0.1411 0.1445 0.1601 0.1430 0.1021 0.0985 0.0996 0.1014 0.1025 0.0987 0.0984 0.1030 0.1023 0.1475 0.1572 0.1595 0.1466 0.1787
va: 3.6307 3.7992 3.4442 3.9334 3.8911 4.0227 3.8748 3.9308 3.9299 3.8624 3.9377 3.8953 3.8754 3.8961 3.8962 3.8990 3.8590 3.9554 3.9165 4.0706 3.9997 3.6401 1.0066 0.9754 0.9986 1.0005 1.0018 1.0187 0.9949 0.9907 0.9964 1.0044 0.9900 1.0051 1.0053 1.0036 1.0053 1.0054 1.0053 1.0031 1.0055 1.0047 1.0044 1.0060 0.9926 0.9905 0.9984 0.9958
dispersion: -0.022086980 hartree
energy: -870.528829629776 hartree
dipole: -13.17916 16.97988 3.80072 -12.66571 10.66172 -2.00399 -6.32400 5.82578 -0.49823
magnitude: 4.32547 au
magnitude: 10.99447 debye
