program: Orca
programVersion: 5.0.2
elementType: N C C C C C C C C C C C C C C C C C C C C C H H H H H H H H H H H H H H H H H H H H H H H H H H
charge: 1
multiplicity: 1
keywords: wb97x-d3
keywords: def2-TZVPP
keywords: def2/J RIJCOSX
keywords: DEFGRID2
keywords: scfconv7
keywords: smallprint printgap noloewdin
keywords: NOSOSCF
formula: C21H26N
InChI: InChI=1/C21H26N/c1-21(2,3)15-8-5-9-16-22(4)17-19-13-10-12-18-11-6-7-14-20(18)19/h5-7,9-14,22H,16-17H2,1-4H3
48 atoms
N  2.363165 -1.30888 -0.326201
C  2.067908 -0.892979 1.090339
C  2.337339 0.561036 1.330858
C  1.41264 1.562035 0.906921
C  1.726791 2.926453 1.154767
C  -4.551686 -1.625334 -1.181908
C  1.75776 -2.645181 -0.665983
C  3.486126 0.928218 1.985216
C  0.187559 1.267478 0.259267
C  3.816315 -1.297731 -0.61806
C  2.927325 3.256909 1.824974
C  3.786431 2.279533 2.238578
C  0.827007 3.935357 0.739136
C  -5.134209 -2.602519 -0.154873
C  -5.230975 -1.825962 -2.540707
C  -4.759154 -0.181765 -0.704927
C  0.271813 -2.620791 -0.525395
C  -0.665465 2.265983 -0.126876
C  -0.343676 3.616119 0.109749
C  -3.114068 -1.870133 -1.315067
C  -0.517861 -2.194585 -1.516461
C  -1.924308 -2.054331 -1.40209
H  2.688317 -1.52195 1.728171
H  1.028117 -1.144321 1.292051
H  2.058882 -2.859454 -1.690604
H  2.222405 -3.377356 -0.006682
H  4.177794 0.162915 2.31676
H  -0.101968 0.242261 0.066875
H  4.21697 -0.304727 -0.438513
H  3.966574 -1.562507 -1.661392
H  4.311592 -2.02176 0.024554
H  3.150966 4.300405 2.012098
H  4.699343 2.534606 2.76026
H  1.081186 4.970801 0.932476
H  -6.205431 -2.426687 -0.040042
H  -4.666588 -2.478159 0.822788
H  -4.995512 -3.638378 -0.467502
H  -4.833341 -1.141227 -3.290996
H  -5.096462 -2.844625 -2.906922
H  -6.302731 -1.639782 -2.450778
H  -5.826234 0.026108 -0.605441
H  -4.291293 -0.010309 0.265558
H  -4.34226 0.535642 -1.413513
H  -0.15656 -2.926107 0.422027
H  -1.59863 2.014538 -0.614878
H  -1.026839 4.395549 -0.201846
H  -0.078769 -1.911349 -2.470474
H  1.925494 -0.626891 -0.952626
elementType: N C H
totalener: -870.50663316 hartree
nucrepener: 1684.91332772 hartree
electener: -2555.41996088 hartree
oneelecener: -4501.06690223 hartree
twoeener: 1945.64694135 hartree
cpcmener: -0.09625560 hartree
kineticenergy: 866.19183330 hartree
xcener: -89.063043587864 hartree
chargesum: 1.0000000
charge: 0.201782 -0.132778 0.040205 -0.071493 -0.038265 0.078570 -0.075687 -0.154201 -0.192606 -0.200735 -0.125787 -0.123496 -0.086861 -0.287958 -0.288353 -0.300168 -0.153524 -0.150316 -0.152458 -0.258976 -0.231954 0.240779 0.151135 0.174035 0.142074 0.145712 0.145975 0.131729 0.143497 0.141016 0.140377 0.144556 0.160116 0.143214 0.098564 0.100088 0.102514 0.100824 0.102504 0.098876 0.103024 0.102239 0.101775 0.148015 0.157970 0.158953 0.146646 0.178852
qa: 0.2018 -0.1328 0.0402 -0.0715 -0.0383 0.0786 -0.0757 -0.1542 -0.1926 -0.2007 -0.1258 -0.1235 -0.0869 -0.2880 -0.2884 -0.3002 -0.1535 -0.1503 -0.1525 -0.2590 -0.2320 0.2408 0.1511 0.1740 0.1421 0.1457 0.1460 0.1317 0.1435 0.1410 0.1404 0.1446 0.1601 0.1432 0.0986 0.1001 0.1025 0.1008 0.1025 0.0989 0.1030 0.1022 0.1018 0.1480 0.1580 0.1590 0.1466 0.1789
va: 3.6308 3.8017 3.4411 3.9405 3.8892 4.0208 3.8750 3.9302 3.9305 3.8622 3.9385 3.8950 3.8748 3.8931 3.8951 3.8996 3.8605 3.9505 3.9196 4.0633 3.9973 3.6450 1.0065 0.9756 0.9984 1.0005 1.0015 1.0190 0.9911 0.9963 0.9949 1.0043 0.9900 1.0049 1.0036 1.0057 1.0053 1.0055 1.0055 1.0032 1.0046 1.0054 1.0046 1.0060 0.9925 0.9909 0.9984 0.9955
dispersion: -0.022194158 hartree
energy: -870.528827318073 hartree
dipole: -13.06162 16.87944 3.81782 -12.59015 10.55780 -2.03235 -6.12000 5.66542 -0.45458
magnitude: 4.34889 au
magnitude: 11.05401 debye
