program: Orca
programVersion: 5.0.2
elementType: N C C C C C C C C C C C C C C C C C C C C C H H H H H H H H H H H H H H H H H H H H H H H H H H
charge: 1
multiplicity: 1
keywords: wb97x-d3
keywords: def2-TZVPP
keywords: def2/J RIJCOSX
keywords: DEFGRID2
keywords: scfconv7
keywords: smallprint printgap noloewdin
keywords: NOSOSCF
formula: C21H26N
InChI: InChI=1/C21H26N/c1-21(2,3)15-8-5-9-16-22(4)17-19-13-10-12-18-11-6-7-14-20(18)19/h5-7,9-14,22H,16-17H2,1-4H3
48 atoms
N  2.341315 -1.266329 -0.366052
C  2.051744 -0.89973 1.064258
C  2.342364 0.540551 1.35505
C  1.448393 1.569808 0.934146
C  1.785769 2.921215 1.217937
C  -4.603751 -1.68655 -1.194153
C  1.73857 -2.592571 -0.746989
C  3.481117 0.86754 2.04662
C  0.232976 1.314357 0.25308
C  3.792801 -1.24066 -0.665884
C  2.97373 3.210656 1.928425
C  3.799881 2.20585 2.343239
C  0.921693 3.95773 0.795884
C  -5.009409 -1.847754 0.274919
C  -5.314694 -2.739473 -2.051825
C  -4.971827 -0.281523 -1.684789
C  0.254103 -2.58676 -0.585723
C  -0.586338 2.339186 -0.137233
C  -0.237837 3.676832 0.128572
C  -3.155582 -1.866908 -1.317296
C  -0.553416 -2.121509 -1.544235
C  -1.960825 -2.011411 -1.410428
H  2.663177 -1.559364 1.678887
H  1.007936 -1.143083 1.255579
H  2.027619 -2.7668 -1.782647
H  2.215659 -3.34566 -0.121171
H  4.1497 0.080681 2.374967
H  -0.079041 0.299296 0.041614
H  3.936727 -1.467196 -1.718734
H  4.293903 -1.985461 -0.052753
H  4.191481 -0.253608 -0.452869
H  3.214904 4.244561 2.144325
H  4.703003 2.429576 2.895316
H  1.193699 4.983268 1.0152
H  -4.756159 -2.839439 0.651963
H  -6.087582 -1.713399 0.379397
H  -4.516438 -1.108337 0.907524
H  -5.043569 -2.645304 -3.10409
H  -5.068184 -3.751144 -1.727243
H  -6.396024 -2.614563 -1.970517
H  -4.474701 0.489526 -1.094221
H  -4.695271 -0.138724 -2.73014
H  -6.049138 -0.129286 -1.597547
H  -0.159141 -2.947525 0.348502
H  -1.512583 2.117723 -0.651903
H  -0.892827 4.477497 -0.189108
H  -0.128381 -1.772905 -2.482646
H  1.898569 -0.565735 -0.96763
elementType: N C H
totalener: -870.50669619 hartree
nucrepener: 1680.91373405 hartree
electener: -2551.42043024 hartree
oneelecener: -4493.07314841 hartree
twoeener: 1941.65271817 hartree
cpcmener: -0.09603198 hartree
kineticenergy: 866.20277611 hartree
xcener: -89.065309038036 hartree
chargesum: 1.0000000
charge: 0.199004 -0.129241 0.030257 -0.068007 -0.039704 0.063124 -0.076558 -0.146784 -0.197400 -0.200560 -0.124680 -0.124402 -0.086308 -0.289299 -0.286316 -0.291697 -0.150902 -0.151782 -0.151387 -0.252844 -0.239522 0.252626 0.150269 0.175409 0.142897 0.145862 0.145178 0.135035 0.141233 0.140575 0.143708 0.144484 0.159943 0.143111 0.101375 0.098372 0.100586 0.101629 0.102204 0.098448 0.099321 0.102766 0.099777 0.147593 0.157576 0.159758 0.146454 0.178820
qa: 0.1990 -0.1292 0.0303 -0.0680 -0.0397 0.0631 -0.0766 -0.1468 -0.1974 -0.2006 -0.1247 -0.1244 -0.0863 -0.2893 -0.2863 -0.2917 -0.1509 -0.1518 -0.1514 -0.2528 -0.2395 0.2526 0.1503 0.1754 0.1429 0.1459 0.1452 0.1350 0.1412 0.1406 0.1437 0.1445 0.1599 0.1431 0.1014 0.0984 0.1006 0.1016 0.1022 0.0984 0.0993 0.1028 0.0998 0.1476 0.1576 0.1598 0.1465 0.1788
va: 3.6324 3.7998 3.4520 3.9304 3.8919 4.0318 3.8725 3.9278 3.9301 3.8622 3.9369 3.8953 3.8748 3.8949 3.8958 3.8992 3.8570 3.9540 3.9150 4.0753 3.9975 3.6329 1.0067 0.9750 0.9983 1.0004 1.0022 1.0181 0.9962 0.9951 0.9908 1.0043 0.9900 1.0051 1.0056 1.0037 1.0056 1.0056 1.0053 1.0030 1.0059 1.0051 1.0037 1.0055 0.9934 0.9902 0.9984 0.9959
dispersion: -0.021966612 hartree
energy: -870.528662799947 hartree
dipole: -13.41623 17.19557 3.77934 -12.89885 10.91260 -1.98625 -6.51571 5.97342 -0.54229
magnitude: 4.30380 au
magnitude: 10.93939 debye
