program: Orca
programVersion: 5.0.2
elementType: N C C C C C C C C C C C C C C C C C C C C C H H H H H H H H H H H H H H H H H H H H H H H H H H
charge: 1
multiplicity: 1
keywords: wb97x-d3
keywords: def2-TZVPP
keywords: def2/J RIJCOSX
keywords: DEFGRID2
keywords: scfconv7
keywords: smallprint printgap noloewdin
keywords: NOSOSCF
formula: C21H26N
InChI: InChI=1/C21H26N/c1-21(2,3)15-8-5-9-16-22(4)17-19-13-10-12-18-11-6-7-14-20(18)19/h5-7,9-14,22H,16-17H2,1-4H3
48 atoms
N  2.265224 -1.336536 -0.146176
C  1.972767 -0.744733 1.206368
C  2.349456 0.703087 1.288702
C  1.538138 1.709945 0.685462
C  1.968193 3.063131 0.757674
C  -4.721744 -1.840992 -0.942232
C  1.610869 -2.678696 -0.33559
C  3.493678 1.059554 1.956277
C  0.319258 1.430921 0.019698
C  3.720088 -1.421967 -0.414347
C  3.157682 3.382357 1.452867
C  3.899625 2.403708 2.049366
C  1.194079 4.073159 0.141616
C  -5.299565 -1.563295 -2.333845
C  -5.0153 -0.659482 -0.009356
C  -5.338457 -3.122008 -0.36775
C  0.127454 -2.600561 -0.188465
C  -0.412674 2.432266 -0.559667
C  0.031533 3.766726 -0.509371
C  -3.271881 -2.015914 -1.046034
C  -0.668332 -2.297667 -1.2190
C  -2.075641 -2.162075 -1.113554
H  2.531914 -1.339898 1.927647
H  0.912446 -0.89371 1.403795
H  1.896155 -3.014468 -1.331733
H  2.056814 -3.349603 0.397778
H  4.100998 0.292033 2.420846
H  -0.062912 0.418586 -0.02844
H  4.163137 -0.433017 -0.348271
H  3.86986 -1.816968 -1.415465
H  4.175129 -2.084008 0.318422
H  3.467486 4.418869 1.510218
H  4.803467 2.651846 2.589636
H  1.538178 5.098941 0.195822
H  -5.095316 -2.384911 -3.021356
H  -4.88399 -0.65074 -2.763296
H  -6.382215 -1.441524 -2.268274
H  -6.093948 -0.516634 0.078073
H  -4.616847 -0.833223 0.990985
H  -4.583261 0.266742 -0.390459
H  -6.420476 -3.005655 -0.28397
H  -5.142033 -3.981875 -1.00928
H  -4.945368 -3.342885 0.625291
H  -0.296488 -2.786613 0.791165
H  -1.344071 2.195754 -1.057975
H  -0.553017 4.546486 -0.979789
H  -0.235562 -2.127371 -2.202055
H  1.863593 -0.716352 -0.855859
elementType: N C H
totalener: -870.50682956 hartree
nucrepener: 1673.73021459 hartree
electener: -2544.23704415 hartree
oneelecener: -4478.73705831 hartree
twoeener: 1934.50001416 hartree
cpcmener: -0.09592965 hartree
kineticenergy: 866.20151862 hartree
xcener: -89.064814375218 hartree
chargesum: 1.0000000
charge: 0.197738 -0.126093 0.029563 -0.068175 -0.039954 0.058548 -0.076146 -0.144509 -0.205302 -0.199316 -0.125709 -0.124402 -0.086528 -0.287328 -0.289687 -0.286562 -0.157732 -0.150732 -0.149656 -0.256768 -0.230363 0.252988 0.150642 0.174149 0.142344 0.146534 0.144528 0.140715 0.143105 0.141356 0.140335 0.145298 0.159597 0.143987 0.101462 0.100049 0.098662 0.099276 0.101392 0.101217 0.098663 0.102461 0.100808 0.147865 0.156127 0.159907 0.146652 0.178995
qa: 0.1977 -0.1261 0.0296 -0.0682 -0.0400 0.0585 -0.0761 -0.1445 -0.2053 -0.1993 -0.1257 -0.1244 -0.0865 -0.2873 -0.2897 -0.2866 -0.1577 -0.1507 -0.1497 -0.2568 -0.2304 0.2530 0.1506 0.1741 0.1423 0.1465 0.1445 0.1407 0.1431 0.1414 0.1403 0.1453 0.1596 0.1440 0.1015 0.1000 0.0987 0.0993 0.1014 0.1012 0.0987 0.1025 0.1008 0.1479 0.1561 0.1599 0.1467 0.1790
va: 3.6368 3.8007 3.4541 3.9165 3.8913 4.0381 3.8698 3.9294 3.9311 3.8627 3.9368 3.8963 3.8740 3.8943 3.8955 3.8918 3.8655 3.9506 3.9113 4.0770 3.9997 3.6383 1.0067 0.9756 0.9988 1.0000 1.0024 1.0134 0.9908 0.9962 0.9953 1.0040 0.9901 1.0048 1.0057 1.0056 1.0034 1.0035 1.0054 1.0059 1.0033 1.0055 1.0060 1.0050 0.9946 0.9898 0.9985 0.9958
dispersion: -0.021693567 hartree
energy: -870.528523131500 hartree
dipole: -14.25814 17.92171 3.66357 -14.03516 11.90953 -2.12563 -4.36964 4.18983 -0.17981
magnitude: 4.23938 au
magnitude: 10.77565 debye
