program: Orca
programVersion: 5.0.2
elementType: N C C C C C C C C C C C C C C C C C C C C C H H H H H H H H H H H H H H H H H H H H H H H H H H
charge: 1
multiplicity: 1
keywords: wb97x-d3
keywords: def2-TZVPP
keywords: def2/J RIJCOSX
keywords: DEFGRID2
keywords: scfconv7
keywords: smallprint printgap noloewdin
keywords: NOSOSCF
formula: C21H26N
InChI: InChI=1/C21H26N/c1-21(2,3)15-8-5-9-16-22(4)17-19-13-10-12-18-11-6-7-14-20(18)19/h5-7,9-14,22H,16-17H2,1-4H3
48 atoms
N  1.338446 -0.271912 -1.130996
C  1.785942 -0.311825 0.303965
C  1.806158 1.043326 0.941013
C  2.812091 1.998447 0.610952
C  2.745529 3.289759 1.201356
C  -4.94699 -3.710668 -0.239268
C  -0.040148 0.292171 -1.33567
C  0.829401 1.368809 1.847375
C  3.880447 1.72352 -0.277469
C  1.501712 -1.602645 -1.763906
C  1.715256 3.583119 2.125083
C  0.784357 2.639317 2.452187
C  3.71555 4.26101 0.862398
C  -6.076397 -2.87141 0.368947
C  -4.378688 -4.661686 0.820136
C  -5.480995 -4.515915 -1.428384
C  -1.108865 -0.567015 -0.757954
C  4.808183 2.683022 -0.582139
C  4.722276 3.969148 -0.015601
C  -3.880202 -2.818354 -0.697928
C  -1.941676 -1.259871 -1.539744
C  -2.991062 -2.086565 -1.06016
H  2.768349 -0.783374 0.299878
H  1.106785 -0.980808 0.82961
H  -0.041096 1.287574 -0.893232
H  -0.158632 0.400368 -2.412472
H  0.072432 0.635812 2.09858
H  3.99268 0.740273 -0.717838
H  0.93146 -2.342098 -1.209787
H  2.55615 -1.863355 -1.749566
H  1.149094 -1.552691 -2.790176
H  1.680956 4.568607 2.573372
H  0.004388 2.862393 3.167557
H  3.647441 5.243345 1.313786
H  -6.874234 -3.528007 0.720315
H  -6.502246 -2.186181 -0.36467
H  -5.723074 -2.285645 1.218069
H  -3.986799 -4.112277 1.676556
H  -5.164667 -5.329295 1.177002
H  -3.574599 -5.274849 0.411799
H  -5.894878 -3.863165 -2.197743
H  -4.69668 -5.122334 -1.882567
H  -6.27401 -5.186869 -1.093652
H  -1.210199 -0.600822 0.320976
H  5.617221 2.449763 -1.261602
H  5.458498 4.719382 -0.271895
H  -1.829071 -1.202973 -2.619167
H  1.96353 0.364526 -1.632363
elementType: N C H
totalener: -870.49839661 hartree
nucrepener: 1631.04045709 hartree
electener: -2501.53885370 hartree
oneelecener: -4393.26325293 hartree
twoeener: 1891.72439922 hartree
cpcmener: -0.11032888 hartree
kineticenergy: 866.21625373 hartree
xcener: -89.068513671452 hartree
chargesum: 1.0000000
charge: 0.222615 -0.129175 0.040612 -0.069724 -0.051954 0.062394 -0.104084 -0.108581 -0.220702 -0.210735 -0.128039 -0.152019 -0.089798 -0.289536 -0.289797 -0.290833 -0.158294 -0.151024 -0.151526 -0.269059 -0.200034 0.237282 0.165607 0.152168 0.155323 0.151535 0.151148 0.150356 0.137015 0.146005 0.142462 0.147144 0.160564 0.146469 0.098436 0.101938 0.101959 0.101517 0.098297 0.101846 0.101298 0.101575 0.098025 0.141528 0.160050 0.161616 0.142598 0.185532
qa: 0.2226 -0.1292 0.0406 -0.0697 -0.0520 0.0624 -0.1041 -0.1086 -0.2207 -0.2107 -0.1280 -0.1520 -0.0898 -0.2895 -0.2898 -0.2908 -0.1583 -0.1510 -0.1515 -0.2691 -0.2000 0.2373 0.1656 0.1522 0.1553 0.1515 0.1511 0.1504 0.1370 0.1460 0.1425 0.1471 0.1606 0.1465 0.0984 0.1019 0.1020 0.1015 0.0983 0.1018 0.1013 0.1016 0.0980 0.1415 0.1601 0.1616 0.1426 0.1855
va: 3.6079 3.8118 3.4496 3.8909 3.8879 4.0268 3.9267 3.8851 3.9432 3.8789 3.9230 3.9193 3.8708 3.8933 3.8926 3.8937 3.8577 3.9276 3.9065 4.0959 4.0026 3.6754 0.9850 0.9926 0.9892 0.9971 1.0000 1.0050 0.9901 0.9961 0.9928 1.0030 0.9908 1.0038 1.0029 1.0055 1.0055 1.0057 1.0031 1.0053 1.0056 1.0053 1.0030 1.0133 0.9921 0.9887 1.0025 0.9881
dispersion: -0.021041260 hartree
energy: -870.519437869364 hartree
dipole: -19.73877 21.89111 2.15234 -21.72939 21.10884 -0.62054 -5.04096 3.19590 -1.84506
magnitude: 2.90204 au
magnitude: 7.37641 debye
