program: Orca
programVersion: 5.0.2
elementType: Cl O O N N N C C C C C C C C C C C C C C H H H H H H H H H H H H H H H H H
charge: 1
multiplicity: 1
keywords: wb97x-d3
keywords: def2-TZVPP
keywords: def2/J RIJCOSX
keywords: DEFGRID2
keywords: scfconv7
keywords: smallprint printgap noloewdin
keywords: NOSOSCF
formula: C14H17ClN3O2
InChI: InChI=1/C14H17ClN3O2/c1-14(2,3)12(19)13(18-9-16-8-17-18)20-11-6-4-10(15)5-7-11/h4-9,13,17H,1-3H3
37 atoms
Cl 5.238492 0.867141 0.596991
O  -0.247971 -0.631731 -0.812988
O  -3.186731 -0.301615 -1.175263
N  -1.337356 1.143227 0.249844
N  -1.901164 1.928277 -0.680864
N  -0.83095 3.225612 0.705825
C  -2.897453 -2.325644 0.090909
C  -2.526036 -0.950521 -0.403677
C  -1.212245 -0.319123 0.120652
C  -1.681703 -3.25854 0.139294
C  -3.452275 -2.124213 1.515642
C  -3.977687 -2.923905 -0.807384
C  1.050917 -0.292365 -0.464458
C  -0.667093 1.966914 1.057431
C  1.710837 -0.968162 0.549788
C  1.67279 0.729677 -1.160652
C  -1.600728 3.17758 -0.367966
C  3.006718 -0.606485 0.878905
C  2.972788 1.085412 -0.836651
C  3.633107 0.422821 0.188239
H  -0.968796 -0.657361 1.133407
H  -2.009534 -4.241649 0.475598
H  -1.216697 -3.382947 -0.837792
H  -0.915134 -2.933114 0.844896
H  -2.713823 -1.715977 2.209408
H  -3.754408 -3.092627 1.914595
H  -4.329829 -1.477476 1.525181
H  -3.622639 -3.060136 -1.828716
H  -4.876115 -2.310293 -0.841669
H  -4.26108 -3.903807 -0.424181
H  -0.075086 1.612854 1.888162
H  1.242796 -1.797675 1.066104
H  1.161468 1.22812 -1.974457
H  -1.960229 4.025384 -0.931043
H  3.534375 -1.135252 1.660292
H  3.470665 1.874254 -1.382856
H  -2.540529 1.495764 -1.351261
totalener: -1318.44982930 hartree
nucrepener: 1719.95689416 hartree
electener: -3038.40672346 hartree
oneelecener: -5197.32458702 hartree
twoeener: 2158.91786356 hartree
kineticenergy: 1314.16116479 hartree
xcener: -103.853836890300 hartree
chargesum: 1.0000000
charge: -0.013797 -0.263382 -0.337707 0.060920 -0.049466 -0.265356 0.125885 0.247455 0.008866 -0.280332 -0.307110 -0.260367 0.189103 0.153309 -0.158398 -0.163883 0.184598 -0.126925 -0.100087 0.062804 0.133682 0.118111 0.127664 0.066866 0.094200 0.118017 0.126464 0.111342 0.107487 0.107793 0.179122 0.150219 0.138737 0.194224 0.142556 0.142098 0.235288
qa: -0.0138 -0.2634 -0.3377 0.0609 -0.0495 -0.2654 0.1259 0.2475 0.0089 -0.2803 -0.3071 -0.2604 0.1891 0.1533 -0.1584 -0.1639 0.1846 -0.1269 -0.1001 0.0628 0.1337 0.1181 0.1277 0.0669 0.0942 0.1180 0.1265 0.1113 0.1075 0.1078 0.1791 0.1502 0.1387 0.1942 0.1426 0.1421 0.2353
va: 1.2902 2.0357 2.1339 3.3541 3.4798 3.0566 3.8471 3.8922 4.0969 3.9294 3.9325 3.9246 3.7192 4.0129 3.9524 3.9783 3.9532 4.0336 4.0084 4.0304 0.9836 1.0085 1.0079 1.0097 1.0045 1.0045 1.0054 1.0075 1.0106 1.0062 0.9870 0.9930 1.0083 0.9769 1.0095 1.0057 1.0267
dispersion: -0.019801698 hartree
energy: -1318.469630996022 hartree
dipole: -29.56889 27.13538 -2.43351 -19.79276 20.36066 0.56790 2.00363 -1.69340 0.31023
magnitude: 2.51808 au
magnitude: 6.40044 debye
