program: Orca
programVersion: 5.0.2
elementType: Cl O O N N N C C C C C C C C C C C C C C H H H H H H H H H H H H H H H H H
charge: 1
multiplicity: 1
keywords: wb97x-d3
keywords: def2-TZVPP
keywords: def2/J RIJCOSX
keywords: DEFGRID2
keywords: scfconv7
keywords: smallprint printgap noloewdin
keywords: NOSOSCF
formula: C14H17ClN3O2
InChI: InChI=1/C14H17ClN3O2/c1-14(2,3)12(19)13(18-9-16-8-17-18)20-11-6-4-10(15)5-7-11/h4-9,13,17H,1-3H3
37 atoms
Cl 5.324661 0.674348 0.408093
O  -0.276738 -0.570409 -0.788188
O  -3.249601 -0.289532 -1.101982
N  -1.391887 1.203057 0.22614
N  -1.647395 1.996668 -0.82058
N  -1.291153 3.278153 0.900348
C  -2.853783 -2.311128 0.141187
C  -2.544424 -0.916843 -0.355437
C  -1.246508 -0.247726 0.147488
C  -1.601663 -3.189369 0.208501
C  -3.435946 -2.136352 1.555575
C  -3.891036 -2.964698 -0.766501
C  1.031561 -0.273943 -0.460137
C  -1.16525 2.014147 1.253264
C  1.638393 -0.819118 0.66069
C  1.733432 0.558127 -1.315888
C  -1.585474 3.240551 -0.390283
C  2.964469 -0.521318 0.930674
C  3.063803 0.847351 -1.053626
C  3.667722 0.309195 0.071507
H  -1.000626 -0.551441 1.168281
H  -1.887323 -4.174935 0.578246
H  -1.142646 -3.326331 -0.770818
H  -0.843825 -2.808057 0.894299
H  -3.684387 -3.119244 1.958699
H  -4.347611 -1.53774 1.545897
H  -2.729555 -1.671851 2.245978
H  -3.524506 -3.068712 -1.788836
H  -4.828499 -2.409909 -0.795332
H  -4.113776 -3.965395 -0.394229
H  -0.913453 1.639937 2.233521
H  1.099442 -1.484796 1.323513
H  1.251515 0.973393 -2.19176
H  -1.763636 4.086332 -1.035236
H  3.442224 -0.94554 1.803232
H  3.616294 1.492017 -1.72349
H  -1.876887 1.633103 -1.741299
elementType: Cl O N C H
totalener: -1318.54633928 hartree
nucrepener: 1711.33883082 hartree
electener: -3029.88517010 hartree
oneelecener: -5179.10760560 hartree
twoeener: 2149.22243550 hartree
cpcmener: -0.10822911 hartree
kineticenergy: 1314.12193511 hartree
xcener: -103.847229811665 hartree
chargesum: 1.0000000
charge: -0.084919 -0.313514 -0.378980 0.074087 -0.028005 -0.349692 0.218551 0.220631 0.141749 -0.328989 -0.320002 -0.316463 0.217989 0.193053 -0.164993 -0.186621 0.200059 -0.148524 -0.117002 0.085467 0.160378 0.109413 0.114581 0.096638 0.109055 0.116722 0.107659 0.109479 0.099963 0.105497 0.196251 0.159087 0.150077 0.206432 0.146858 0.146542 0.251486
qa: -0.0849 -0.3135 -0.3790 0.0741 -0.0280 -0.3497 0.2186 0.2206 0.1417 -0.3290 -0.3200 -0.3165 0.2180 0.1931 -0.1650 -0.1866 0.2001 -0.1485 -0.1170 0.0855 0.1604 0.1094 0.1146 0.0966 0.1091 0.1167 0.1077 0.1095 0.1000 0.1055 0.1963 0.1591 0.1501 0.2064 0.1469 0.1465 0.2515
va: 1.2173 2.0266 2.0973 3.3526 3.5261 3.0476 3.7194 4.0105 3.8785 3.9484 3.9388 3.9281 3.7714 3.9786 3.9540 3.9996 3.9459 4.0078 3.9737 3.8544 0.9714 1.0049 1.0064 1.0025 1.0009 1.0056 1.0022 1.0040 1.0105 1.0041 0.9810 0.9928 1.0060 0.9717 1.0049 1.0020 0.9797
dispersion: -0.019512742 hartree
energy: -1318.565852024164 hartree
dipole: -28.90978 26.19819 -2.71159 -19.15500 20.15688 1.00188 2.56277 -2.23863 0.32415
magnitude: 2.90887 au
magnitude: 7.39376 debye
