program: Orca
programVersion: 5.0.2
elementType: Cl O O N N N C C C C C C C C C C C C C C H H H H H H H H H H H H H H H H H
charge: 1
multiplicity: 1
keywords: wb97x-d3
keywords: def2-TZVPP
keywords: def2/J RIJCOSX
keywords: DEFGRID2
keywords: scfconv7
keywords: smallprint printgap noloewdin
keywords: NOSOSCF
formula: C14H17ClN3O2
InChI: InChI=1/C14H17ClN3O2/c1-14(2,3)12(19)13(18-9-16-8-17-18)20-11-6-4-10(15)5-7-11/h4-9,13,17H,1-3H3
37 atoms
Cl 5.309967 0.720146 0.402623
O  -0.275006 -0.57818 -0.81241
O  -3.229648 -0.283789 -1.11971
N  -1.371864 1.169024 0.269192
N  -1.683532 1.992652 -0.739199
N  -1.180315 3.226347 0.97987
C  -2.872368 -2.320621 0.107903
C  -2.53957 -0.926762 -0.371816
C  -1.235061 -0.279405 0.142942
C  -1.633388 -3.219207 0.152236
C  -3.442727 -2.157424 1.528336
C  -3.92572 -2.942315 -0.803629
C  1.032132 -0.272646 -0.486777
C  -1.054604 1.952441 1.294839
C  1.67648 -0.908213 0.563189
C  1.690914 0.663833 -1.26502
C  -1.569696 3.224356 -0.286149
C  2.998476 -0.598928 0.839469
C  3.016671 0.968207 -0.995797
C  3.658364 0.337714 0.058251
H  -0.977206 -0.617767 1.150078
H  -1.934201 -4.210013 0.495067
H  -1.175586 -3.33614 -0.830306
H  -0.87108 -2.866836 0.848492
H  -2.724071 -1.716191 2.221279
H  -3.706482 -3.141816 1.917721
H  -4.343579 -1.542585 1.533553
H  -3.564234 -3.043097 -1.828063
H  -4.851346 -2.367563 -0.823784
H  -4.168403 -3.942056 -0.441468
H  -0.738646 1.551381 2.245565
H  1.166611 -1.652439 1.162611
H  1.180046 1.148885 -2.087081
H  -1.779318 4.088084 -0.897061
H  3.506633 -1.095074 1.655129
H  3.536121 1.695523 -1.604772
H  -1.993073 1.65287 -1.645547
elementType: Cl O N C H
totalener: -1318.54643779 hartree
nucrepener: 1713.22270724 hartree
electener: -3031.76914502 hartree
oneelecener: -5182.86766274 hartree
twoeener: 2151.09851772 hartree
cpcmener: -0.10734734 hartree
kineticenergy: 1314.12093229 hartree
xcener: -103.846895777807 hartree
chargesum: 1.0000000
charge: -0.084734 -0.311557 -0.382541 0.070028 -0.026633 -0.347872 0.217030 0.224882 0.138104 -0.328974 -0.318641 -0.315458 0.203830 0.191858 -0.158352 -0.176572 0.201454 -0.154292 -0.124892 0.092841 0.160623 0.109452 0.115547 0.096155 0.107653 0.109025 0.116615 0.109447 0.099933 0.105359 0.195736 0.164327 0.150994 0.205970 0.146290 0.146923 0.250445
qa: -0.0847 -0.3116 -0.3825 0.0700 -0.0266 -0.3479 0.2170 0.2249 0.1381 -0.3290 -0.3186 -0.3155 0.2038 0.1919 -0.1584 -0.1766 0.2015 -0.1543 -0.1249 0.0928 0.1606 0.1095 0.1155 0.0962 0.1077 0.1090 0.1166 0.1094 0.0999 0.1054 0.1957 0.1643 0.1510 0.2060 0.1463 0.1469 0.2504
va: 1.2173 2.0260 2.0900 3.3600 3.5223 3.0465 3.7286 3.9946 3.8951 3.9458 3.9381 3.9283 3.7831 3.9800 3.9473 3.9898 3.9456 4.0165 3.9806 3.8489 0.9723 1.0048 1.0063 1.0027 1.0026 1.0009 1.0055 1.0041 1.0104 1.0042 0.9814 0.9887 1.0056 0.9720 1.0056 1.0021 0.9830
dispersion: -0.019592551 hartree
energy: -1318.566030336727 hartree
dipole: -29.13044 26.34982 -2.78062 -19.33126 20.28380 0.95254 2.34812 -1.92756 0.42056
magnitude: 2.96919 au
magnitude: 7.54707 debye
