program: Orca
programVersion: 5.0.2
elementType: Cl O O N N N C C C C C C C C C C C C C C H H H H H H H H H H H H H H H H H
charge: 1
multiplicity: 1
keywords: wb97x-d3
keywords: def2-TZVPP
keywords: def2/J RIJCOSX
keywords: DEFGRID2
keywords: scfconv7
keywords: smallprint printgap noloewdin
keywords: NOSOSCF
formula: C14H17ClN3O2
InChI: InChI=1/C14H17ClN3O2/c1-14(2,3)12(19)13(18-9-16-8-17-18)20-11-6-4-10(15)5-7-11/h4-9,13,17H,1-3H3
37 atoms
Cl -5.481321 -0.321941 0.109779
O  0.272746 0.452419 -0.700054
O  3.213669 0.408788 -1.076678
N  1.493222 -1.358925 0.121581
N  1.710441 -2.026752 -1.017118
N  1.736618 -3.475591 0.609554
C  2.745458 2.197237 0.468571
C  2.502496 0.878536 -0.226223
C  1.252561 0.078706 0.202386
C  3.303242 1.849861 1.860093
C  3.773959 3.011696 -0.30814
C  1.45133 3.002993 0.619332
C  -1.05651 0.231637 -0.425892
C  1.509819 -2.267571 1.089281
C  -1.923085 0.530951 -1.469317
C  -1.54586 -0.242927 0.780852
C  1.847589 -3.297019 -0.699439
C  -3.285654 0.361768 -1.307312
C  -2.915355 -0.412196 0.941282
C  -3.7755 -0.109882 -0.098115
H  0.999466 0.262421 1.248717
H  2.594812 1.286173 2.468666
H  4.227489 1.275432 1.789664
H  3.523396 2.7771 2.390485
H  3.433521 3.231025 -1.320955
H  4.737741 2.507167 -0.372617
H  3.934864 3.963027 0.199609
H  1.021519 3.267489 -0.346936
H  1.681193 3.930153 1.145142
H  0.68983 2.489414 1.207835
H  1.35711 -2.003904 2.124056
H  -1.532174 0.897841 -2.409171
H  -0.907544 -0.487296 1.618688
H  2.03042 -4.060031 -1.438405
H  -3.955751 0.597748 -2.122351
H  -3.294501 -0.7809 1.884156
H  1.734138 -1.570267 -1.924957
elementType: Cl O N C H
totalener: -1318.54477849 hartree
nucrepener: 1701.93880687 hartree
electener: -3020.48358535 hartree
oneelecener: -5160.14286508 hartree
twoeener: 2139.65927973 hartree
cpcmener: -0.12527071 hartree
kineticenergy: 1314.10166860 hartree
xcener: -103.847223912840 hartree
chargesum: 1.0000000
charge: -0.097346 -0.293093 -0.391776 0.085486 -0.024996 -0.360744 0.230918 0.219998 0.126001 -0.317319 -0.326777 -0.329127 0.329970 0.193430 -0.261778 -0.185319 0.204508 -0.103681 -0.168388 0.077339 0.175956 0.108393 0.115467 0.107372 0.109689 0.101006 0.105519 0.114347 0.108346 0.097281 0.199490 0.149113 0.142614 0.206950 0.147828 0.146798 0.256530
qa: -0.0973 -0.2931 -0.3918 0.0855 -0.0250 -0.3607 0.2309 0.2200 0.1260 -0.3173 -0.3268 -0.3291 0.3300 0.1934 -0.2618 -0.1853 0.2045 -0.1037 -0.1684 0.0773 0.1760 0.1084 0.1155 0.1074 0.1097 0.1010 0.1055 0.1143 0.1083 0.0973 0.1995 0.1491 0.1426 0.2069 0.1478 0.1468 0.2565
va: 1.2052 2.0543 2.0881 3.3635 3.5269 3.0430 3.7159 4.0221 3.8727 3.9375 3.9294 3.9520 3.6492 3.9766 4.0425 3.9361 3.9420 3.9600 4.0184 3.8357 0.9626 1.0034 1.0054 1.0007 1.0036 1.0087 1.0044 1.0042 1.0039 1.0060 0.9793 1.0074 1.0084 0.9710 1.0016 1.0050 0.9733
dispersion: -0.019068900 hartree
energy: -1318.563847386857 hartree
dipole: 28.34620 -25.41708 2.92913 17.21027 -18.59158 -1.38131 5.84547 -5.46385 0.38162
magnitude: 3.26089 au
magnitude: 8.28853 debye
