program: Orca
programVersion: 5.0.2
elementType: Cl O O N N N C C C C C C C C C C C C C C H H H H H H H H H H H H H H H H H
charge: 1
multiplicity: 1
keywords: wb97x-d3
keywords: def2-TZVPP
keywords: def2/J RIJCOSX
keywords: DEFGRID2
keywords: scfconv7
keywords: smallprint printgap noloewdin
keywords: NOSOSCF
formula: C14H17ClN3O2
InChI: InChI=1/C14H17ClN3O2/c1-14(2,3)12(19)13(18-9-16-8-17-18)20-11-6-4-10(15)5-7-11/h4-9,13,17H,1-3H3
37 atoms
Cl -5.281288 -0.74095 0.507982
O  0.274427 0.581607 -0.821149
O  3.228548 0.322725 -1.178644
N  1.395671 -1.170068 0.234589
N  1.749165 -1.98928 -0.765797
N  1.045604 -3.232027 0.881057
C  2.873728 2.327679 0.099715
C  2.543949 0.94247 -0.403565
C  1.255009 0.277141 0.119205
C  3.43762 2.144231 1.520082
C  3.93015 2.966361 -0.795905
C  1.632511 3.222923 0.152076
C  -1.025163 0.26714 -0.466273
C  0.948822 -1.957843 1.207678
C  -1.640655 0.877167 0.615964
C  -1.70391 -0.652549 -1.247379
C  1.54417 -3.220267 -0.347927
C  -2.955685 0.562642 0.918665
C  -3.023207 -0.961524 -0.951896
C  -3.636677 -0.353323 0.131273
H  1.007928 0.605732 1.131565
H  2.714676 1.694084 2.20194
H  4.337568 1.528478 1.519191
H  3.699426 3.124147 1.921198
H  4.8580 2.395326 -0.816122
H  4.164707 3.961192 -0.416273
H  3.574383 3.079807 -1.820838
H  0.866355 2.854605 0.835322
H  1.183721 3.356121 -0.832382
H  1.931619 4.206622 0.51528
H  0.569021 -1.560923 2.136113
H  -1.112963 1.603453 1.221661
H  -1.214322 -1.120956 -2.09108
H  1.771135 -4.080039 -0.957443
H  -3.441241 1.038094 1.759637
H  -3.558444 -1.675255 -1.562784
H  2.159034 -1.642308 -1.629346
elementType: Cl O N C H
totalener: -1318.54435605 hartree
nucrepener: 1715.07114210 hartree
electener: -3033.61549815 hartree
oneelecener: -5186.39408643 hartree
twoeener: 2152.77858828 hartree
cpcmener: -0.12084147 hartree
kineticenergy: 1314.10888708 hartree
xcener: -103.845278087029 hartree
chargesum: 1.0000000
charge: -0.092988 -0.318370 -0.401961 0.064895 -0.021444 -0.354618 0.225929 0.238079 0.149309 -0.320448 -0.322734 -0.332583 0.206754 0.189538 -0.156445 -0.177038 0.206092 -0.156293 -0.130009 0.096897 0.168004 0.110782 0.115658 0.107445 0.099401 0.105176 0.109863 0.101003 0.113995 0.108100 0.197650 0.166491 0.152704 0.206063 0.146495 0.147273 0.251334
qa: -0.0930 -0.3184 -0.4020 0.0649 -0.0214 -0.3546 0.2259 0.2381 0.1493 -0.3204 -0.3227 -0.3326 0.2068 0.1895 -0.1564 -0.1770 0.2061 -0.1563 -0.1300 0.0969 0.1680 0.1108 0.1157 0.1074 0.0994 0.1052 0.1099 0.1010 0.1140 0.1081 0.1976 0.1665 0.1527 0.2061 0.1465 0.1473 0.2513
va: 1.2091 2.0212 2.0679 3.3702 3.5207 3.0385 3.7283 3.9814 3.8920 3.9388 3.9275 3.9460 3.7707 3.9830 3.9392 3.9890 3.9437 4.0118 3.9807 3.8229 0.9704 1.0026 1.0054 1.0002 1.0100 1.0040 1.0038 1.0023 1.0060 1.0042 0.9810 0.9886 1.0052 0.9722 1.0051 1.0017 0.9850
dispersion: -0.019656257 hartree
energy: -1318.564012307622 hartree
dipole: 29.15023 -26.18236 2.96787 19.36336 -20.35112 -0.98776 2.17963 -1.71696 0.46267
magnitude: 3.16196 au
magnitude: 8.03707 debye
