program: Orca
programVersion: 5.0.2
elementType: Cl O O N N N C C C C C C C C C C C C C C H H H H H H H H H H H H H H H H H
charge: 1
multiplicity: 1
keywords: wb97x-d3
keywords: def2-TZVPP
keywords: def2/J RIJCOSX
keywords: DEFGRID2
keywords: scfconv7
keywords: smallprint printgap noloewdin
keywords: NOSOSCF
formula: C14H17ClN3O2
InChI: InChI=1/C14H17ClN3O2/c1-14(2,3)12(19)13(18-9-16-8-17-18)20-11-6-4-10(15)5-7-11/h4-9,13,17H,1-3H3
37 atoms
Cl -5.278496 -0.921813 0.172153
O  0.264544 0.729324 -0.777628
O  3.145844 0.579089 -1.143565
N  1.353613 -1.120736 0.14912
N  1.766419 -1.836306 -0.906307
N  0.984387 -3.23676 0.570452
C  2.894205 2.282398 0.539607
C  2.508265 1.046171 -0.232446
C  1.204486 0.32951 0.169546
C  1.700462 3.235465 0.667537
C  3.337866 1.814999 1.936726
C  4.049723 2.991316 -0.157389
C  -1.03778 0.335771 -0.521821
C  0.862925 -2.001432 1.015718
C  -1.61596 -0.598541 -1.363797
C  -1.745018 0.882667 0.537213
C  1.546724 -3.102699 -0.623346
C  -2.931569 -0.984911 -1.1542
C  -3.056315 0.491595 0.754144
C  -3.637455 -0.438729 -0.09465
H  0.904505 0.55145 1.19559
H  2.023462 4.122886 1.213029
H  1.333668 3.560095 -0.30681
H  0.865584 2.808123 1.225025
H  2.537017 1.3251 2.492084
H  3.647464 2.686609 2.514597
H  4.184962 1.130539 1.880419
H  3.783329 3.304627 -1.167517
H  4.941037 2.366514 -0.21607
H  4.313056 3.886493 0.406546
H  0.432869 -1.696907 1.957205
H  -1.054413 -1.016156 -2.189305
H  -1.285799 1.61661 1.187821
H  1.812228 -3.898289 -1.300522
H  -3.391896 -1.708717 -1.812432
H  -3.616154 0.91617 1.575917
H  2.217839 -1.399776 -1.706714
elementType: Cl O N C H
totalener: -1318.54420093 hartree
nucrepener: 1717.38459759 hartree
electener: -3035.92879852 hartree
oneelecener: -5190.99296022 hartree
twoeener: 2155.06416170 hartree
cpcmener: -0.12057624 hartree
kineticenergy: 1314.11504581 hartree
xcener: -103.845701805181 hartree
chargesum: 1.0000000
charge: -0.092883 -0.315949 -0.402047 0.066999 -0.027266 -0.351983 0.224913 0.236788 0.140237 -0.327660 -0.317970 -0.325907 0.186635 0.187709 -0.162916 -0.149557 0.209726 -0.140115 -0.162479 0.103202 0.166841 0.108786 0.115801 0.099768 0.108409 0.107190 0.116554 0.108931 0.101981 0.105589 0.198131 0.154836 0.171336 0.205961 0.148578 0.148688 0.253146
qa: -0.0929 -0.3159 -0.4020 0.0670 -0.0273 -0.3520 0.2249 0.2368 0.1402 -0.3277 -0.3180 -0.3259 0.1866 0.1877 -0.1629 -0.1496 0.2097 -0.1401 -0.1625 0.1032 0.1668 0.1088 0.1158 0.0998 0.1084 0.1072 0.1166 0.1089 0.1020 0.1056 0.1981 0.1548 0.1713 0.2060 0.1486 0.1487 0.2531
va: 1.2092 2.0262 2.0669 3.3703 3.5145 3.0386 3.7346 3.9566 3.9233 3.9465 3.9388 3.9288 3.7928 3.9825 3.9714 3.9372 3.9421 3.9884 4.0144 3.8223 0.9710 1.0030 1.0050 1.0036 1.0040 1.0002 1.0045 1.0044 1.0074 1.0046 0.9811 1.0038 0.9846 0.9723 1.0017 1.0048 0.9862
dispersion: -0.019782754 hartree
energy: -1318.563983679954 hartree
dipole: 29.45571 -26.45513 3.00058 18.84589 -19.85438 -1.00849 6.38575 -5.77882 0.60693
magnitude: 3.22318 au
magnitude: 8.19267 debye
