program: Orca
programVersion: 5.0.2
elementType: Cl O O N N N C C C C C C C C C C C C C C H H H H H H H H H H H H H H H H H
charge: 1
multiplicity: 1
keywords: wb97x-d3
keywords: def2-TZVPP
keywords: def2/J RIJCOSX
keywords: DEFGRID2
keywords: scfconv7
keywords: smallprint printgap noloewdin
keywords: NOSOSCF
formula: C14H17ClN3O2
InChI: InChI=1/C14H17ClN3O2/c1-14(2,3)12(19)13(18-9-16-8-17-18)20-11-6-4-10(15)5-7-11/h4-9,13,16H,1-3H3
37 atoms
Cl 5.49892 0.043952 0.121242
O  -0.292495 -0.398243 -0.654972
O  -3.384628 -0.084041 -0.662724
N  -1.448073 1.487123 0.07523
N  -1.631808 2.292522 1.130328
N  -2.077207 3.332402 -0.729623
C  -2.664886 -2.148399 0.345074
C  -2.541509 -0.692649 -0.063901
C  -1.209843 0.051885 0.256083
C  -4.111415 -2.405326 0.780405
C  -2.349119 -2.99248 -0.90387
C  -1.708992 -2.520813 1.479845
C  1.059798 -0.248202 -0.401958
C  -1.734479 2.090165 -1.056026
C  1.900233 -0.943811 -1.25772
C  1.576552 0.537512 0.61459
C  -2.01046 3.420536 0.629597
C  3.269788 -0.853087 -1.097875
C  2.953903 0.620434 0.774334
C  3.796687 -0.069786 -0.07891
H  -0.912606 -0.067709 1.302406
H  -4.230136 -3.460405 1.026733
H  -4.377328 -1.830321 1.668392
H  -4.824128 -2.164859 -0.006043
H  -2.463035 -4.047568 -0.654143
H  -1.329157 -2.845766 -1.257011
H  -3.035338 -2.76845 -1.72014
H  -1.887306 -1.933073 2.382894
H  -0.657109 -2.430002 1.203409
H  -1.866878 -3.563837 1.75191
H  -1.6821 1.674241 -2.048618
H  1.483786 -1.558257 -2.04512
H  0.953532 1.097243 1.300322
H  -2.237174 4.309622 1.194579
H  3.927479 -1.396839 -1.761436
H  3.364321 1.228136 1.568411
H  -2.346195 4.062529 -1.375084
totalener: -1318.46207047 hartree
nucrepener: 1701.48053329 hartree
electener: -3019.94260376 hartree
oneelecener: -5161.71243038 hartree
twoeener: 2141.76982662 hartree
kineticenergy: 1314.16618102 hartree
xcener: -103.853268159392 hartree
chargesum: 1.0000000
charge: -0.027467 -0.282392 -0.307225 0.128310 -0.244767 -0.116860 0.170438 0.177021 0.055754 -0.267778 -0.293727 -0.328057 0.272802 0.177155 -0.216760 -0.168014 0.154091 -0.070453 -0.156206 0.050421 0.173719 0.106191 0.099381 0.114083 0.109488 0.102537 0.116014 0.105191 0.102351 0.114135 0.215034 0.136874 0.118956 0.193541 0.139261 0.135275 0.211680
qa: -0.0275 -0.2824 -0.3072 0.1283 -0.2448 -0.1169 0.1704 0.1770 0.0558 -0.2678 -0.2937 -0.3281 0.2728 0.1772 -0.2168 -0.1680 0.1541 -0.0705 -0.1562 0.0504 0.1737 0.1062 0.0994 0.1141 0.1095 0.1025 0.1160 0.1052 0.1024 0.1141 0.2150 0.1369 0.1190 0.1935 0.1393 0.1353 0.2117
va: 1.2765 2.0470 2.1693 3.4130 2.8884 3.5532 3.7886 4.0277 3.8872 3.9229 3.9420 3.9238 3.6954 3.9715 4.0523 3.9537 3.9237 3.9778 4.0764 4.0301 0.9745 1.0057 1.0054 1.0135 1.0052 1.0072 1.0079 1.0045 1.0031 1.0107 0.9782 1.0093 1.0168 0.9785 1.0064 1.0114 0.9905
dispersion: -0.018841516 hartree
energy: -1318.480911989544 hartree
dipole: -28.02967 25.25804 -2.77163 -14.93705 17.84233 2.90528 2.55969 -3.18687 -0.62718
magnitude: 4.06398 au
magnitude: 10.32982 debye
