program: Orca
programVersion: 5.0.2
elementType: Cl O O N N N C C C C C C C C C C C C C C H H H H H H H H H H H H H H H H H H H
charge: 1
multiplicity: 1
keywords: wb97x-d3
keywords: def2-TZVPP
keywords: def2/J RIJCOSX
keywords: DEFGRID2
keywords: scfconv7
keywords: smallprint printgap noloewdin
keywords: NOSOSCF
formula: C14H19ClN3O2
InChI: InChI=1/C14H19ClN3O2/c1-14(2,3)12(19)13(18-9-16-8-17-18)20-11-6-4-10(15)5-7-11/h4-9,12-13,17,19H,1-3H3
39 atoms
Cl 5.43279 -1.001067 0.192216
O  -2.755829 0.44649 -1.615287
O  -0.038317 0.604353 -1.159405
N  -1.192008 -0.63577 0.428522
N  -1.794896 -1.623463 -0.243085
N  -1.015699 -2.471107 1.601621
C  -3.265158 1.846365 0.353307
C  -2.225396 1.361294 -0.681537
C  -0.961624 0.709044 -0.118975
C  -4.409603 2.500864 -0.429011
C  -3.845987 0.723065 1.212092
C  -2.630159 2.910289 1.250696
C  -0.710542 -1.188128 1.535638
C  1.238875 0.233227 -0.807487
C  -1.689429 -2.714707 0.48748
C  2.05624 1.095504 -0.091606
C  1.702973 -1.007404 -1.214077
C  3.350993 0.713008 0.219086
C  3.000957 -1.390256 -0.911234
C  3.813438 -0.52781 -0.192927
H  -1.852958 2.25872 -1.193296
H  -0.574848 1.282432 0.726398
H  -4.048496 3.279562 -1.105703
H  -4.981291 1.779911 -1.016171
H  -5.110743 2.971446 0.2618
H  -4.679764 1.109454 1.801558
H  -3.128272 0.31675 1.925987
H  -4.239396 -0.098503 0.610549
H  -3.389393 3.359811 1.892681
H  -2.180487 3.715963 0.66555
H  -1.860845 2.506276 1.911475
H  -3.243312 0.914374 -2.301166
H  -0.15254 -0.621887 2.265353
H  -2.111994 -3.65973 0.185305
H  1.698023 2.070474 0.21517
H  1.061029 -1.672342 -1.778222
H  3.992718 1.384971 0.772461
H  3.367024 -2.355722 -1.232832
H  -2.297072 -1.431673 -1.1103
elementType: Cl O N C H
totalener: -1319.76643827 hartree
nucrepener: 1766.11638233 hartree
electener: -3085.88282060 hartree
oneelecener: -5290.54697248 hartree
twoeener: 2204.66415189 hartree
cpcmener: -0.10219717 hartree
kineticenergy: 1315.26253243 hartree
xcener: -104.288997845117 hartree
chargesum: 1.0000000
charge: -0.086720 -0.401684 -0.312801 0.058533 -0.030681 -0.339654 0.246960 0.081740 0.110536 -0.345017 -0.378943 -0.358856 0.176350 0.200670 0.198868 -0.167886 -0.175630 -0.143947 -0.136026 0.089784 0.128327 0.167244 0.108733 0.099057 0.099003 0.111317 0.098052 0.105504 0.104391 0.110915 0.096501 0.229720 0.196631 0.203828 0.156586 0.149178 0.146535 0.146955 0.255927
qa: -0.0867 -0.4017 -0.3128 0.0585 -0.0307 -0.3397 0.2470 0.0817 0.1105 -0.3450 -0.3789 -0.3589 0.1763 0.2007 0.1989 -0.1679 -0.1756 -0.1439 -0.1360 0.0898 0.1283 0.1672 0.1087 0.0991 0.0990 0.1113 0.0981 0.1055 0.1044 0.1109 0.0965 0.2297 0.1966 0.2038 0.1566 0.1492 0.1465 0.1470 0.2559
va: 1.2155 2.0176 2.0648 3.3480 3.4696 3.0486 3.6641 3.9775 3.9792 3.9174 3.9496 3.9406 3.9754 3.7830 3.9529 3.9574 3.9625 3.9793 3.9815 3.8511 1.0099 0.9713 1.0013 1.0101 1.0068 1.0062 0.9992 1.0154 1.0040 1.0035 1.0025 1.0101 0.9830 0.9736 0.9972 1.0048 1.0032 1.0022 0.9996
dispersion: -0.021826885 hartree
energy: -1319.788265157093 hartree
dipole: -39.16367 35.26968 -3.89398 17.63394 -17.63808 -0.00414 3.08468 -3.28878 -0.20410
magnitude: 3.89933 au
magnitude: 9.91131 debye
