program: Orca
programVersion: 5.0.2
elementType: Cl O O N N N C C C C C C C C C C C C C C H H H H H H H H H H H H H H H H H H H
charge: 1
multiplicity: 1
keywords: wb97x-d3
keywords: def2-TZVPP
keywords: def2/J RIJCOSX
keywords: DEFGRID2
keywords: scfconv7
keywords: smallprint printgap noloewdin
keywords: NOSOSCF
formula: C14H19ClN3O2
InChI: InChI=1/C14H19ClN3O2/c1-14(2,3)12(19)13(18-9-16-8-17-18)20-11-6-4-10(15)5-7-11/h4-9,12-13,17,19H,1-3H3
39 atoms
Cl -5.390575 1.136533 0.478929
O  2.594154 -0.63161 -1.805431
O  -0.057472 -0.647732 -1.175501
N  1.210011 0.595385 0.323888
N  1.846847 1.539938 -0.378835
N  1.130211 2.461957 1.460732
C  3.225693 -1.877713 0.24565
C  2.129612 -1.461242 -0.762139
C  0.915823 -0.751212 -0.174042
C  3.954025 -0.702446 0.898756
C  2.604216 -2.762022 1.328575
C  4.251198 -2.71508 -0.52772
C  0.771748 1.19044 1.425044
C  -1.302442 -0.232473 -0.753067
C  1.801062 2.647253 0.332514
C  -1.760357 1.0092 -1.162561
C  -2.088904 -1.051347 0.043968
C  -3.025702 1.43429 -0.786226
C  -3.350384 -0.626757 0.428104
C  -3.809136 0.612245 0.00727
H  1.718371 -2.395745 -1.16901
H  0.547837 -1.291662 0.699873
H  4.79962 -1.081381 1.475502
H  4.35864 -0.00377 0.165053
H  3.328325 -0.147503 1.599204
H  2.01239 -3.572967 0.897884
H  1.962342 -2.200716 2.010212
H  3.389664 -3.215692 1.934404
H  4.811977 -2.127236 -1.257585
H  3.778586 -3.547623 -1.053698
H  4.984139 -3.134267 0.162644
H  3.282853 -1.084307 -2.304899
H  0.20314 0.662953 2.174845
H  2.262766 3.563801 0.002535
H  -1.140178 1.642049 -1.784138
H  -1.731252 -2.023285 0.36015
H  -3.387599 2.400535 -1.109282
H  -3.968051 -1.264653 1.045125
H  2.331664 1.300966 -1.24414
elementType: Cl O N C H
totalener: -1319.76345922 hartree
nucrepener: 1768.74052654 hartree
electener: -3088.50398576 hartree
oneelecener: -5295.56583280 hartree
twoeener: 2207.06184705 hartree
cpcmener: -0.11645440 hartree
kineticenergy: 1315.26058611 hartree
xcener: -104.289183397883 hartree
chargesum: 1.0000000
charge: -0.094310 -0.409214 -0.323738 0.069836 -0.028312 -0.345160 0.245410 0.081907 0.110184 -0.380004 -0.367950 -0.342352 0.168624 0.198879 0.205135 -0.169251 -0.162911 -0.142400 -0.149358 0.094922 0.128097 0.172850 0.110062 0.106011 0.101085 0.113592 0.097315 0.104181 0.099581 0.109810 0.097143 0.236067 0.196834 0.204012 0.151244 0.158802 0.147492 0.146728 0.259156
qa: -0.0943 -0.4092 -0.3237 0.0698 -0.0283 -0.3452 0.2454 0.0819 0.1102 -0.3800 -0.3680 -0.3424 0.1686 0.1989 0.2051 -0.1693 -0.1629 -0.1424 -0.1494 0.0949 0.1281 0.1728 0.1101 0.1060 0.1011 0.1136 0.0973 0.1042 0.0996 0.1098 0.0971 0.2361 0.1968 0.2040 0.1512 0.1588 0.1475 0.1467 0.2592
va: 1.2080 2.0185 2.0541 3.3468 3.4721 3.0439 3.7032 3.9703 3.9702 3.9546 3.9459 3.9164 3.9889 3.7781 3.9498 3.9598 3.9525 3.9816 3.9794 3.8256 1.0119 0.9667 1.0058 1.0146 0.9971 1.0031 1.0008 1.0044 1.0080 1.0018 1.0059 1.0081 0.9836 0.9736 1.0035 0.9963 1.0019 1.0029 0.9955
dispersion: -0.021956719 hartree
energy: -1319.785415936387 hartree
dipole: 39.11367 -34.86530 4.24837 -18.12672 18.02779 -0.09893 1.86811 -2.03164 -0.16353
magnitude: 4.25267 au
magnitude: 10.80942 debye
