program: Orca
programVersion: 5.0.2
elementType: Cl O O N N N C C C C C C C C C C C C C C H H H H H H H H H H H H H H H H H H H
charge: 1
multiplicity: 1
keywords: wb97x-d3
keywords: def2-TZVPP
keywords: def2/J RIJCOSX
keywords: DEFGRID2
keywords: scfconv7
keywords: smallprint printgap noloewdin
keywords: NOSOSCF
formula: C14H19ClN3O2
InChI: InChI=1/C14H19ClN3O2/c1-14(2,3)12(19)13(18-9-16-8-17-18)20-11-6-4-10(15)5-7-11/h4-9,12-13,17,19H,1-3H3
39 atoms
Cl -5.430362 1.143016 0.360397
O  2.546179 -1.051324 -1.688948
O  -0.085265 -0.925911 -0.877206
N  1.266443 0.688508 0.105447
N  1.814626 1.411635 -0.879083
N  1.265175 2.787937 0.718354
C  3.297443 -1.769854 0.564042
C  2.143624 -1.593738 -0.449981
C  0.967415 -0.744346 0.024883
C  3.994795 -0.463787 0.944105
C  2.756757 -2.452932 1.821517
C  4.3288 -2.705291 -0.078001
C  0.928547 1.554931 1.051161
C  -1.319696 -0.427195 -0.527861
C  1.816774 2.666389 -0.480955
C  -1.898353 -0.67256 0.709992
C  -2.000192 0.303133 -1.490186
C  -3.164882 -0.180608 0.984229
C  -3.273552 0.781215 -1.223983
C  -3.844203 0.540253 0.015692
H  1.708485 -2.592282 -0.594175
H  0.701083 -1.021212 1.045102
H  4.882923 -0.687549 1.537668
H  4.330108 0.097105 0.070084
H  3.371063 0.188833 1.556454
H  2.216578 -3.371099 1.580215
H  2.087672 -1.811182 2.39688
H  3.581628 -2.722697 2.482528
H  5.095325 -2.967485 0.652199
H  4.843794 -2.244985 -0.923532
H  3.871137 -3.635423 -0.422721
H  3.117472 -1.676232 -2.148693
H  0.450244 1.247612 1.968095
H  2.224012 3.462388 -1.083264
H  -1.391153 -1.255288 1.468014
H  -1.541906 0.492295 -2.452151
H  -3.61584 -0.373917 1.947855
H  -3.805433 1.345234 -1.977684
H  2.21866 0.954613 -1.696627
elementType: Cl O N C H
totalener: -1319.76335137 hartree
nucrepener: 1761.75972083 hartree
electener: -3081.52307220 hartree
oneelecener: -5281.67894220 hartree
twoeener: 2200.15587001 hartree
cpcmener: -0.11665939 hartree
kineticenergy: 1315.25205145 hartree
xcener: -104.288791070113 hartree
chargesum: 1.0000000
charge: -0.096346 -0.409799 -0.315202 0.071639 -0.028839 -0.354337 0.246548 0.084894 0.094231 -0.379573 -0.365724 -0.346144 0.183473 0.236656 0.204762 -0.178143 -0.211774 -0.132890 -0.117394 0.074925 0.126377 0.180431 0.109229 0.106181 0.101456 0.110214 0.097909 0.103171 0.097383 0.099058 0.111119 0.234768 0.203084 0.204863 0.147934 0.149557 0.149258 0.148544 0.258501
qa: -0.0963 -0.4098 -0.3152 0.0716 -0.0288 -0.3543 0.2465 0.0849 0.0942 -0.3796 -0.3657 -0.3461 0.1835 0.2367 0.2048 -0.1781 -0.2118 -0.1329 -0.1174 0.0749 0.1264 0.1804 0.1092 0.1062 0.1015 0.1102 0.0979 0.1032 0.0974 0.0991 0.1111 0.2348 0.2031 0.2049 0.1479 0.1496 0.1493 0.1485 0.2585
va: 1.2062 2.0133 2.0711 3.3326 3.4748 3.0492 3.6887 3.9881 3.9905 3.9520 3.9442 3.9149 3.9728 3.7476 3.9499 3.9364 4.0142 3.9541 3.9616 3.8372 1.0129 0.9583 1.0056 1.0152 0.9975 1.0041 1.0016 1.0036 1.0063 1.0084 1.0014 1.0076 0.9794 0.9728 1.0027 1.0066 1.0023 1.0009 0.9955
dispersion: -0.021530731 hartree
energy: -1319.784882096392 hartree
dipole: 39.61606 -35.37006 4.24599 -17.00660 16.87947 -0.12713 4.61727 -5.05914 -0.44187
magnitude: 4.27082 au
magnitude: 10.85555 debye
