program: Orca
programVersion: 5.0.2
elementType: Cl O O N N N C C C C C C C C C C C C C C H H H H H H H H H H H H H H H H H H H
charge: 1
multiplicity: 1
keywords: wb97x-d3
keywords: def2-TZVPP
keywords: def2/J RIJCOSX
keywords: DEFGRID2
keywords: scfconv7
keywords: smallprint printgap noloewdin
keywords: NOSOSCF
formula: C14H19ClN3O2
InChI: InChI=1/C14H19ClN3O2/c1-14(2,3)12(19)13(18-9-16-8-17-18)20-11-6-4-10(15)5-7-11/h4-9,12-13,17,19H,1-3H3
39 atoms
Cl -5.568017 0.915325 0.081378
O  2.575443 -1.069344 -1.631644
O  -0.058796 -0.898806 -0.770986
N  1.265821 0.731669 0.227008
N  1.789136 1.451098 -0.773025
N  1.410954 2.811941 0.886887
C  3.395549 -1.593973 0.580337
C  2.173044 -1.524919 -0.358036
C  0.978311 -0.70121 0.141257
C  4.333523 -2.666665 0.014173
C  4.176409 -0.281759 0.69071
C  2.946955 -2.035645 1.974441
C  1.035625 1.587966 1.213491
C  -1.323337 -0.452285 -0.490482
C  1.880165 2.694213 -0.347471
C  -1.814084 -0.242846 0.7909
C  -2.140232 -0.239928 -1.594308
C  -3.125059 0.180834 0.963369
C  -3.449613 0.171752 -1.421927
C  -3.933722 0.384989 -0.139796
H  1.776149 -2.546341 -0.42065
H  0.713093 -1.0001 1.155912
H  3.824532 -3.627598 -0.089831
H  4.736742 -2.392315 -0.960699
H  5.179139 -2.811647 0.688043
H  3.633644 0.498969 1.225112
H  4.482908 0.109713 -0.279633
H  5.088887 -0.462035 1.261977
H  2.325631 -2.933046 1.934268
H  2.389222 -1.259769 2.502938
H  3.81979 -2.268188 2.585723
H  1.979746 -1.424877 -2.301497
H  0.607129 1.279704 2.154026
H  2.286527 3.484384 -0.957741
H  -1.216451 -0.413727 1.675838
H  -1.753097 -0.402013 -2.59183
H  -3.50163 0.342944 1.963963
H  -4.079584 0.331976 -2.285898
H  2.132954 0.997805 -1.619272
elementType: Cl O N C H
totalener: -1319.76462646 hartree
nucrepener: 1757.72376359 hartree
electener: -3077.48839005 hartree
oneelecener: -5273.11818244 hartree
twoeener: 2195.62979239 hartree
cpcmener: -0.12043052 hartree
kineticenergy: 1315.23822549 hartree
xcener: -104.287607842735 hartree
chargesum: 1.0000000
charge: -0.099426 -0.422661 -0.307252 0.072078 -0.026892 -0.355917 0.261815 0.111425 0.063680 -0.340040 -0.377625 -0.367911 0.189312 0.299978 0.207431 -0.208431 -0.248123 -0.159424 -0.110874 0.080895 0.127866 0.176195 0.101441 0.097191 0.098660 0.097945 0.109260 0.110058 0.113585 0.095267 0.104982 0.243965 0.201661 0.204592 0.151425 0.149062 0.147434 0.147390 0.259983
qa: -0.0994 -0.4227 -0.3073 0.0721 -0.0269 -0.3559 0.2618 0.1114 0.0637 -0.3400 -0.3776 -0.3679 0.1893 0.3000 0.2074 -0.2084 -0.2481 -0.1594 -0.1109 0.0809 0.1279 0.1762 0.1014 0.0972 0.0987 0.0979 0.1093 0.1101 0.1136 0.0953 0.1050 0.2440 0.2017 0.2046 0.1514 0.1491 0.1474 0.1474 0.2600
va: 1.2031 2.0149 2.0892 3.3162 3.4822 3.0515 3.6521 3.9470 4.0212 3.9194 3.9618 3.9514 3.9739 3.6987 3.9452 3.9269 4.0311 4.0011 3.9624 3.8295 1.0035 0.9599 1.0032 1.0154 1.0053 0.9977 1.0101 1.0067 1.0025 1.0003 1.0055 0.9962 0.9797 0.9731 1.0003 1.0063 1.0048 1.0017 0.9907
dispersion: -0.021499816 hartree
energy: -1319.786126276352 hartree
dipole: 39.73344 -36.36449 3.36895 -14.80927 15.02357 0.21430 5.19770 -5.60451 -0.40680
magnitude: 3.40019 au
magnitude: 8.64259 debye
