program: Gaussian 09
title: 000004850
version: EM64L-G09RevD.01
frameworkgroup: C1[X(C16H18N4O2)]
method: RPBEPBE
basis: SDD
operation: Freq
keyword: #p
keyword: freq=noraman
keyword: PBEPBE/SDD
title: #p freq=noraman PBEPBE/SDD
converged: YES YES NO NO
title: Mulliken charges:
elementType: O O N N N N C C C C C C C C C C C C C C C C H H H H H H H H H H H H H H H H H H
charge: -0.270064 -0.266021 -0.098745 -0.119387 -0.090123 -0.092106 -0.346948 -0.350423 -0.398750 -0.389901 -0.496834 0.509691 0.110634 -0.485085 -0.458308 0.205219 0.157932 -0.326126 -0.202226 -0.281175 -0.281176 -0.199260 0.231141 0.197147 0.188371 0.211560 0.265281 0.219290 0.214933 0.264602 0.219971 0.198614 0.286648 0.237278 0.249255 0.235540 0.235707 0.240894 0.240621 0.232328
chargesum: 0.00000
title: Mulliken charges with hydrogens summed into heavy atoms:
elementType: O O N N N N C C C C C C C C C C C C C C C C
charge: -0.270064 -0.266021 -0.098745 -0.119387 -0.090123 -0.092106 0.081340 0.049507 0.085821 0.089633 -0.078249 0.509691 0.110634 -0.198437 -0.221029 0.205219 0.157932 -0.076871 0.269021 -0.040281 -0.040555 0.033068
polarizability: 3.06539692e+02 1.70974600e+01 1.67603143e+02 5.54468728e+00 -8.09395361e-01 1.58096992e+02
1716.lowfreq: -58.5947 -8.6684 -0.0005 0.0003 0.0007 2.6128 15.1359 20.3853 26.0051
frequency: -58.5874 20.0424 25.5165 34.9466 47.3810 83.9078 121.9301 131.5891 156.3556 171.4137 221.2867 245.4326 270.2244 284.7181 300.3264 328.1907 358.6480 403.9285 407.3802 421.3414 429.0185 465.3357 493.5993 513.7064 517.5991 544.8356 587.2813 608.1583 626.5208 627.2889 678.8314 716.1971 730.0103 752.8843 766.4106 778.3825 778.7111 791.6499 813.4562 842.8853 844.2800 890.7678 912.7455 921.5689 930.3205 938.9483 953.1098 962.4494 962.8855 978.8434 1000.9555 1003.7964 1045.3008 1051.4529 1057.3253 1063.8274 1065.4842 1075.4705 1101.9116 1119.3568 1121.9382 1139.5500 1142.4305 1172.7667 1178.8454 1196.1662 1213.5541 1243.1818 1249.4287 1262.1130 1266.3707 1282.2203 1293.6178 1302.1347 1324.4835 1335.3051 1355.8961 1357.8286 1365.4279 1377.6491 1384.5147 1405.4312 1408.9709 1440.1649 1455.2297 1460.5019 1461.1325 1464.7623 1472.7205 1478.1971 1487.4997 1505.5994 1522.6161 1571.2593 1610.7327 1630.4047 2850.5366 2855.3390 2869.0501 2975.6927 2979.3680 2986.8187 3009.3066 3028.6064 3049.1393 3085.6952 3104.0380 3105.0950 3124.9744 3125.9079 3134.0153 3175.3470 3180.2293 3187.2311
redmass: 2.3225 5.2607 5.3769 5.0359 5.6830 4.3606 4.5736 5.5111 4.3947 4.9402 6.0161 5.0880 2.1853 2.7855 3.0383 3.1441 5.3253 2.0134 4.1834 3.0033 4.0895 2.7980 4.1947 2.7982 5.4465 4.9195 5.3452 5.4387 2.1743 7.4669 9.5173 4.8011 5.0527 5.3606 3.4640 1.8926 4.3097 2.5486 1.4474 3.0824 2.4536 1.5208 2.6751 5.5945 1.4168 2.1968 1.3723 2.5245 1.8420 5.1368 2.1081 2.2278 2.6381 1.7140 3.5232 2.2670 1.4585 1.6426 2.3027 1.0365 1.7965 2.4582 2.3570 1.7146 1.9934 1.1361 1.5093 1.7709 4.8868 1.8286 1.6530 1.5100 1.4434 2.0003 1.3423 1.3204 1.3837 1.4438 1.2863 1.8141 1.6843 1.8675 2.5085 4.7014 1.1097 1.0861 1.1243 1.1797 1.3746 1.5424 1.2241 5.6304 4.4264 5.7539 7.9246 8.2667 1.0706 1.0715 1.0693 1.0680 1.0684 1.0870 1.0533 1.0896 1.0893 1.1189 1.0935 1.0948 1.0905 1.0923 1.0898 1.0928 1.0953 1.0981
irintensity: 14.7990 0.0861 0.0566 0.1780 0.3361 0.1503 0.2696 7.7062 1.8163 0.5645 0.3241 2.0643 3.7976 0.4792 6.3362 7.7684 5.9902 0.4094 0.0030 10.9447 1.3740 0.3611 10.2493 3.0021 5.1408 5.8184 2.8258 3.2483 2.4237 3.5774 0.9081 1.2128 0.9050 8.2633 16.0825 13.4518 15.9239 51.1043 48.8056 19.4192 12.6041 23.0839 5.7194 2.9100 2.6015 0.8208 0.0004 61.4950 31.6075 155.9384 39.6626 42.2013 3.4059 0.4849 17.5063 6.0752 4.3145 0.1482 19.1607 0.0153 23.6112 14.5584 12.9333 20.8175 1.3898 5.3723 1.9323 24.4032 241.9170 9.6535 49.2583 5.2115 39.2281 37.1438 30.4663 27.6976 86.5470 11.1243 2.2104 8.5351 75.9356 0.0334 7.6993 56.6785 21.6190 20.5445 68.9732 33.2527 71.1051 43.3404 16.5273 80.0972 204.2401 653.0732 4.3293 0.1701 32.1192 41.9210 170.5774 17.6695 92.9946 21.1056 132.7279 56.1340 32.4577 34.9562 4.0245 6.8929 28.9121 30.0055 10.3886 1.9472 6.3854 18.1459
temp: 298.150 k
press: 1.00000 atm
elementType: 8 8 7 7 7 7 6 6 6 6 6 6 6 6 6 6 6 6 6 6 6 6 1 1 1 1 1 1 1 1 1 1 1 1 1 1 1 1 1 1
symmnumber: 1
zpe: 841843.0 jmol-1
zpe.correction: 0.320641 hartree
zpe.thermalcorrener: 0.338362 hartree
zpe.thermalcorrenthalpy: 0.339306 hartree
zpe.thermalcorrgfe: 0.272551 hartree
zpe.sumelectzpe: -988.306059 hartree
zpe.sumelectthermal: -988.288339 hartree
zpe.sumelectthermalent: -988.287394 hartree
zpe.sumelectthermalfe: -988.354149 hartree
dipole: -0.0085 0.5695 0.4543
dipole: 0.7285
quadrupole: -116.0348 -123.5544 -128.2401
quadrupole: 3.5687 4.8987 1.0083
quadrupole: 6.5750 -0.9446 -5.6303 3.5687 4.8987 1.0083
hfenergy: -988.6267002 hartree
pointgroup: C01 [X(C16H18N4O2)]
dipole: -0.0087658 -0.2208703 -0.182477 debye
polarizability: 305.7995961|-19.3712524|168.2503974|-7.180487|-0.3718124|158.1898336 unknown
InChI: InChI=1S/C16H18N4O2/c1-4-17-16(18-5-1)20-8-6-19(7-9-20)11-13-2-3-14-15(10-13)22-12-21-14/h1-5,10H,6-9,11-12H2
charge 0 multiplicity 1
40 atoms
O  -4.574467 1.414619 1.489998
O  -6.049535 1.035744 -0.371063
N  -0.002099 -1.081439 0.299598
N  2.620776 0.056678 0.473653
N  4.191646 1.294147 -0.784533
N  4.893661 -0.558068 0.669664
C  0.439479 -0.057828 -0.681832
C  1.14386 -1.902795 0.762389
C  1.505462 0.862797 -0.058177
C  2.218007 -1.007382 1.411705
C  -1.133443 -1.901396 -0.194726
C  -2.434133 -1.111834 -0.310853
C  3.932884 0.268983 0.110589
C  -2.789543 -0.193648 0.722138
C  -3.305903 -1.323499 -1.406004
C  -4.01289 0.462565 0.599274
C  -4.880872 0.240623 -0.492129
C  -4.555411 -0.649528 -1.51636
C  -5.88169 1.799296 0.894951
C  5.493574 1.489264 -1.116822
C  6.17953 -0.320471 0.304389
C  6.551232 0.705856 -0.596465
H  -0.43522 0.546761 -0.980562
H  0.859763 -0.535476 -1.603381
H  1.61116 -2.47552 -0.078897
H  0.779653 -2.631936 1.510414
H  1.910987 1.566181 -0.800589
H  1.04507 1.435753 0.772124
H  1.793691 -0.542262 2.324674
H  3.113325 -1.586897 1.682036
H  -1.270669 -2.7283 0.531618
H  -0.90845 -2.380136 -1.181621
H  -2.106029 -0.015712 1.556239
H  -3.012927 -2.025243 -2.195349
H  -5.225653 -0.81377 -2.363727
H  -5.868343 2.878695 0.663817
H  -6.690266 1.519969 1.592651
H  5.68549 2.303225 -1.826157
H  6.930524 -0.981589 0.753273
H  7.592267 0.881471 -0.875248
