program: Orca
programVersion: 5.0.2
elementType: Cl O O N N N C C C C C C C C C C C C C C H H H H H H H H H H H H H H H H H H H
charge: 1
multiplicity: 1
keywords: wb97x-d3
keywords: def2-TZVPP
keywords: def2/J RIJCOSX
keywords: DEFGRID2
keywords: scfconv7
keywords: smallprint printgap noloewdin
keywords: NOSOSCF
formula: C14H19ClN3O2
InChI: InChI=1/C14H19ClN3O2/c1-14(2,3)12(19)13(18-9-16-8-17-18)20-11-6-4-10(15)5-7-11/h4-9,12-13,16,19H,1-3H3
39 atoms
Cl -5.491647 0.437783 0.478436
O  2.631271 -0.39894 -1.842251
O  0.030259 -0.787164 -1.055791
N  1.103038 0.798933 0.262611
N  0.847144 1.196618 1.516464
N  1.285315 2.902648 0.240319
C  3.549439 -1.220678 0.24341
C  2.327266 -1.157806 -0.696673
C  1.016524 -0.634834 -0.097774
C  4.620622 -2.04391 -0.482172
C  4.141641 0.153322 0.573189
C  3.171988 -1.941719 1.539921
C  1.363931 1.816994 -0.525327
C  -1.266071 -0.513192 -0.662211
C  0.965458 2.482673 1.496106
C  -1.890168 -1.249655 0.332227
C  -1.941482 0.503606 -1.315663
C  -3.195813 -0.953291 0.68593
C  -3.251737 0.7945 -0.969687
C  -3.871322 0.07181 0.038404
H  2.091332 -2.197451 -0.963272
H  0.779569 -1.127166 0.848087
H  4.263693 -3.047783 -0.721129
H  4.94374 -1.569377 -1.407862
H  5.499782 -2.157405 0.152118
H  5.093646 0.019398 1.08756
H  3.518829 0.738969 1.251566
H  4.348757 0.739196 -0.322695
H  2.69931 -2.908343 1.350018
H  2.506095 -1.354992 2.176415
H  4.067637 -2.138746 2.129112
H  2.256009 -0.820211 -2.619542
H  1.610114 1.775385 -1.572407
H  0.826691 3.13541 2.342062
H  -1.382566 -2.070887 0.822691
H  -1.461632 1.046415 -2.120388
H  -3.691457 -1.52837 1.455407
H  -3.790089 1.576707 -1.48639
H  1.436376 3.854321 -0.064499
totalener: -1319.67853055 hartree
nucrepener: 1764.89005144 hartree
electener: -3084.56858199 hartree
oneelecener: -5290.00944836 hartree
twoeener: 2205.44086637 hartree
kineticenergy: 1315.31282502 hartree
xcener: -104.292663157378 hartree
chargesum: 1.0000000
charge: -0.027995 -0.370087 -0.296711 0.148049 -0.221886 -0.095992 0.193536 0.105941 0.008652 -0.305860 -0.351068 -0.336229 0.125795 0.211875 0.145847 -0.141975 -0.212961 -0.102647 -0.093887 0.042155 0.117794 0.161279 0.096351 0.112059 0.102035 0.119698 0.073164 0.116664 0.113067 0.084065 0.113883 0.209792 0.215267 0.192014 0.128291 0.134606 0.139591 0.137129 0.208700
qa: -0.0280 -0.3701 -0.2967 0.1480 -0.2219 -0.0960 0.1935 0.1059 0.0087 -0.3059 -0.3511 -0.3362 0.1258 0.2119 0.1458 -0.1420 -0.2130 -0.1026 -0.0939 0.0422 0.1178 0.1613 0.0964 0.1121 0.1020 0.1197 0.0732 0.1167 0.1131 0.0841 0.1139 0.2098 0.2153 0.1920 0.1283 0.1346 0.1396 0.1371 0.2087
va: 1.2760 2.0605 2.0708 3.3799 2.8613 3.5435 3.7268 3.9147 4.0557 3.9249 3.9305 3.9432 3.9477 3.8127 3.9190 4.0032 4.0089 3.9898 3.9921 4.0335 1.0023 0.9746 1.0062 1.0111 1.0086 1.0162 1.0019 1.0106 1.0050 1.0046 1.0106 1.0288 1.0029 0.9804 1.0078 1.0079 1.0068 1.0074 0.9919
dispersion: -0.021608339 hartree
energy: -1319.700138892823 hartree
dipole: 40.95047 -38.47045 2.48002 -8.69030 11.13126 2.44097 1.34274 -1.43088 -0.08814
magnitude: 3.48089 au
magnitude: 8.84771 debye
