program: Orca
programVersion: 5.0.2
elementType: Cl O O N N N C C C C C C C C C C C C C C H H H H H H H H H H H H H H H H H H H
charge: 1
multiplicity: 1
keywords: wb97x-d3
keywords: def2-TZVPP
keywords: def2/J RIJCOSX
keywords: DEFGRID2
keywords: scfconv7
keywords: smallprint printgap noloewdin
keywords: NOSOSCF
formula: C14H19ClN3O2
InChI: InChI=1/C14H19ClN3O2/c1-14(2,3)12(19)13(18-9-16-8-17-18)20-11-6-4-10(15)5-7-11/h4-9,12-13,16,19H,1-3H3
39 atoms
Cl -5.570223 -0.032994 0.443966
O  2.896389 -0.296719 -1.564503
O  0.065742 -0.623039 -1.053306
N  1.18746 1.132808 -0.048328
N  1.090248 1.789797 1.119342
N  1.34942 3.178595 -0.530908
C  3.329628 -1.34403 0.627916
C  2.335843 -1.048789 -0.517902
C  1.045247 -0.331716 -0.103537
C  4.550525 -2.033242 0.010757
C  3.790796 -0.090185 1.368673
C  2.68429 -2.319155 1.615387
C  1.334797 1.963896 -1.058666
C  -1.242799 -0.468786 -0.663953
C  1.200169 3.039749 0.810275
C  -2.037933 0.437191 -1.347398
C  -1.774774 -1.242132 0.359027
C  -3.377215 0.571128 -1.010779
C  -3.108676 -1.104044 0.704371
C  -3.900569 -0.197078 0.016374
H  1.994521 -2.026796 -0.883822
H  0.74439 -0.614711 0.906571
H  4.268139 -2.90663 -0.582903
H  5.130916 -1.363541 -0.626022
H  5.220127 -2.380648 0.799205
H  4.604172 -0.344071 2.051337
H  2.99945 0.350092 1.976494
H  4.169963 0.676854 0.690258
H  1.817492 -1.897885 2.129223
H  3.40094 -2.600423 2.38909
H  2.361961 -3.238322 1.119831
H  3.402579 -0.879076 -2.140101
H  1.405318 1.722968 -2.10548
H  1.171276 3.865235 1.501789
H  -1.623867 1.029776 -2.153276
H  -1.162132 -1.96615 0.882463
H  -3.999165 1.27463 -1.54756
H  -3.52331 -1.710162 1.498373
H  1.439654 4.047283 -1.047344
elementType: Cl O N C H
totalener: -1319.77553127 hartree
nucrepener: 1751.02521833 hartree
electener: -3070.80074960 hartree
oneelecener: -5262.29683488 hartree
twoeener: 2191.49608528 hartree
cpcmener: -0.10268375 hartree
kineticenergy: 1315.26660517 hartree
xcener: -104.285546777323 hartree
chargesum: 1.0000000
charge: -0.090166 -0.405218 -0.336962 0.132693 -0.292170 -0.089382 0.237025 0.120073 0.115244 -0.347073 -0.378077 -0.353333 0.186651 0.210808 0.162721 -0.193745 -0.167135 -0.125998 -0.158801 0.087542 0.112012 0.166518 0.107282 0.096417 0.098014 0.107643 0.099093 0.101523 0.095402 0.103400 0.104805 0.228204 0.211872 0.201718 0.151271 0.161915 0.147000 0.146900 0.244313
qa: -0.0902 -0.4052 -0.3370 0.1327 -0.2922 -0.0894 0.2370 0.1201 0.1152 -0.3471 -0.3781 -0.3533 0.1867 0.2108 0.1627 -0.1937 -0.1671 -0.1260 -0.1588 0.0875 0.1120 0.1665 0.1073 0.0964 0.0980 0.1076 0.0991 0.1015 0.0954 0.1034 0.1048 0.2282 0.2119 0.2017 0.1513 0.1619 0.1470 0.1469 0.2443
va: 1.2119 2.0148 2.0366 3.4335 2.8817 3.5688 3.6564 3.9248 3.8713 3.9176 3.9353 3.9366 3.9286 3.8234 3.9232 4.0012 3.9536 3.9707 3.9907 3.8474 1.0184 0.9825 1.0015 1.0114 1.0071 1.0072 1.0068 1.0128 1.0050 1.0036 1.0052 1.0094 0.9913 0.9761 1.0014 0.9929 1.0024 1.0041 0.9673
dispersion: -0.020905260 hartree
energy: -1319.796436529055 hartree
dipole: 39.67185 -36.12387 3.54798 -8.92746 12.31782 3.39036 4.14584 -5.37269 -1.22684
magnitude: 5.05844 au
magnitude: 12.85754 debye
