program: Gaussian 09
title: 000071002
version: EM64L-G09RevD.01
frameworkgroup: C1[X(C10H11NO3)]
method: RPBEPBE
basis: SDD
operation: Freq
keyword: #p
keyword: freq=noraman
keyword: PBEPBE/SDD
title: #p freq=noraman PBEPBE/SDD
converged: YES YES NO NO
title: Mulliken charges:
elementType: O O O N C C C C C C C C C C H H H H H H H H H H H
charge: -0.400770 -0.291364 -0.245270 -0.433149 -0.095119 -0.672410 0.267932 0.181705 0.149499 -0.350403 -0.346688 -0.223806 -0.241313 -0.226651 0.285236 0.342858 0.272741 0.238225 0.213250 0.276089 0.215823 0.232069 0.230291 0.232392 0.388833
chargesum: 0.00000
title: Mulliken charges with hydrogens summed into heavy atoms:
elementType: O O O N C C C C C C C C C C
charge: -0.011936 -0.291364 -0.245270 -0.090291 0.190117 0.051806 0.267932 0.181705 0.149499 -0.074314 -0.130864 0.008262 -0.011021 0.005741
polarizability: 1.75848805e+02 5.19311452e+00 1.28268684e+02 3.40794014e+00 5.43154058e+00 6.30426913e+01
1716.lowfreq: -11.1405 -5.0994 -0.0008 -0.0007 -0.0006 7.0335 25.5822 51.3883 63.0245
frequency: 25.5093 51.3754 63.0242 71.9348 93.7270 180.5875 207.1137 210.2349 242.7235 290.6162 315.0367 369.8104 400.7802 439.2708 451.3801 533.3415 568.0289 589.0899 602.1252 614.4488 660.9347 687.2231 702.1251 704.0272 784.7689 795.1373 853.5038 875.6876 921.5938 936.1852 985.5006 989.4475 1007.4262 1024.5229 1048.2866 1059.6733 1076.9557 1085.2805 1116.4813 1172.9171 1180.4020 1194.2573 1233.8357 1271.6676 1306.7313 1320.1395 1350.6284 1384.7934 1385.4590 1432.3399 1459.5041 1475.7204 1481.8314 1503.2406 1562.4463 1602.2882 1611.6423 1649.3435 3000.8170 3017.9866 3107.0869 3119.2287 3119.4116 3131.8330 3145.1451 3158.4730 3169.6155 3520.0549 3528.7491
redmass: 4.0126 6.4526 5.4504 6.4660 4.9689 4.7407 4.5893 4.1437 1.1363 3.7582 6.9309 3.7864 2.7969 5.1504 3.9911 3.8405 2.5717 1.2320 1.5949 6.0433 6.0472 4.6038 1.5186 3.5080 3.9475 2.4846 1.2592 3.2201 2.2363 1.4629 1.3909 5.9153 1.3422 2.4557 2.5847 1.6730 2.7157 1.6322 2.1566 1.0691 2.2996 1.2150 1.4107 2.0559 1.3414 1.3403 1.9782 1.5836 4.3183 2.2177 1.3737 1.5480 1.0481 2.1170 7.4953 6.7313 6.0390 8.3875 1.0350 1.0822 1.1013 1.1015 1.0874 1.0871 1.0922 1.0956 1.1006 1.0643 1.0772
irintensity: 0.1304 1.1734 4.5430 4.1289 1.6255 1.7130 6.1136 9.1221 0.0732 2.1582 3.7084 3.5449 0.1617 3.0646 11.6046 68.6933 42.4951 95.4743 60.6421 0.2142 5.6019 21.4962 146.7334 18.1524 1.7785 19.9116 0.1668 23.2853 13.4529 4.2001 0.8093 0.9006 1.5900 1.4592 276.0602 27.8436 37.0677 14.7951 12.6873 0.6001 0.9455 6.8360 6.1655 23.8377 23.5666 1.2401 151.9595 32.8972 5.7301 5.0847 194.8098 23.5139 16.7554 217.8928 137.9575 54.2527 6.9932 163.5221 18.8861 13.0959 20.6443 10.4938 8.6789 2.1923 22.6882 15.2334 21.2584 42.5798 43.8266
temp: 298.150 k
press: 1.00000 atm
elementType: 8 8 8 7 6 6 6 6 6 6 6 6 6 6 1 1 1 1 1 1 1 1 1 1 1
symmnumber: 1
zpe: 509803.6 jmol-1
zpe.correction: 0.194174 hartree
zpe.thermalcorrener: 0.207432 hartree
zpe.thermalcorrenthalpy: 0.208376 hartree
zpe.thermalcorrgfe: 0.152684 hartree
zpe.sumelectzpe: -667.088924 hartree
zpe.sumelectthermal: -667.075666 hartree
zpe.sumelectthermalent: -667.074722 hartree
zpe.sumelectthermalfe: -667.130414 hartree
dipole: -0.8389 2.2232 0.9633
dipole: 2.5640
quadrupole: -58.7675 -85.8084 -84.8251
quadrupole: -0.3561 1.2733 -3.1750
quadrupole: 17.6995 -9.3414 -8.3581 -0.3561 1.2733 -3.1750
hfenergy: -667.2830979 hartree
pointgroup: C01 [X(C10H11N1O3)]
dipole: -0.3420905 -0.9073912 -0.2778969 debye
dipolederiv: -1.3277444 0.1992775 0.2226124 0.1422654 -0.2717301 -0.0304926 0.2402933 -0.0430245 -0.4591222 -0.8131001 0.1609808 -0.002294 -0.0530435 -0.8959997 -0.1401946 -0.0659093 -0.0982147 -0.3959303 -0.7789232 -0.036233 0.0838642 0.1938432 -0.9177602 -0.0171365 0.1194187 -0.0252599 -0.3171082 -1.3114534 -0.1725479 -0.1447668 -0.4299518 -0.5408523 0.0147105 -0.1716405 0.0292564 -0.4688587 0.6069866 -0.0912007 0.0960573 -0.3604231 -0.1079999 0.0531108 0.0334908 0.020332 0.2681607 -0.1682637 -0.0972753 -0.0072603 0.0117077 0.0075917 0.0472655 -0.0408164 0.0309888 0.0313248 -0.3819806 0.1006407 0.0083557 0.1726165 -0.0987493 -0.0185699 0.0424618 -0.0246042 -0.004582 1.8417169 -0.03969 0.111819 0.2663687 1.0620131 0.2432806 0.1694848 0.15999 0.2693375 1.6053705 -0.0133034 -0.3690533 -0.1079361 1.186469 0.008002 -0.375315 0.0574194 0.2523429 -0.0426034 -0.085875 -0.0046456 0.0716374 0.0388608 -0.0091164 0.0155765 0.0089079 -0.1144726 0.0282619 0.0617833 -0.0282784 -0.0380382 -0.0075804 -0.0108754 -0.0624716 -0.0049869 -0.141789 0.0609849 0.1535417 -0.018339 0.1507153 -0.0257357 -0.0115726 -0.0181721 -0.013224 -0.1528201 -0.1901745 -0.0157828 0.0001168 -0.0751616 0.1369366 -0.012172 0.0005509 -0.0129673 -0.1477277 0.0937778 -0.0561835 -0.0160194 -0.0093859 -0.0072415 -0.0021313 -0.0150367 -0.0018934 -0.1474217 0.0324249 -0.0141711 -0.008462 0.0887135 0.0784309 -0.0564178 0.0414531 -0.021108 -0.0181262 0.3123251 0.0241856 -0.0183642 0.1519894 0.1677435 -0.0393164 0.0060964 -0.0374751 0.2982897 0.0959098 -0.0976191 0.0277278 -0.1010517 -0.002173 0.0363576 0.0539072 0.0206233 0.0818518 -0.1296973 0.0860531 -0.0013933 0.1032637 0.0967307 0.0082879 -0.0081006 -0.0171537 0.0749446 0.1109621 0.0296727 0.0104804 0.0022796 -0.0004043 -0.1218853 -0.011532 -0.0521963 -0.0727861 0.1515363 0.0353851 0.0007193 -0.0014229 -0.0076912 0.0098314 -0.014427 0.0019913 0.1541085 -0.0467484 -0.1074293 0.0189743 -0.1137641 0.0359928 0.0122842 0.0293653 0.0068956 0.1431879 -0.0603933 -0.09025 0.0144561 -0.1064428 0.0099948 0.0115193 0.0168919 0.0112492 0.1560405 0.0687441 0.0263596 0.0046458 0.0533257 -0.1158986 0.0110297 0.0059165 0.012742 0.1581105 -0.1030052 0.0744188 0.0126262 0.0773948 0.0641852 -0.0000519 0.0121878 -0.0014424 0.1587211 0.3450867 -0.0347378 0.0064211 -0.089499 0.114867 0.0142533 -0.0036738 -0.0068455 0.3943242 unknown
polarizability: 175.6887411|-6.1352811|128.8059183|-3.0957432|-1.9092061|62.6655203 unknown
InChI: InChI=1S/C10H11NO3/c1-7(10(13)14)11-9(12)8-5-3-2-4-6-8/h2-7,11,13H,1H3
charge 0 multiplicity 1
25 atoms
O  -4.54834 -0.301952 0.501197
O  -0.037683 2.069127 0.312131
O  -2.916057 -1.897575 0.071873
N  -0.964783 -0.005392 -0.128623
C  -2.335928 0.503947 -0.022547
C  -2.772795 1.327468 -1.267537
C  1.488904 0.193795 0.012495
C  0.121273 0.825043 0.07991
C  -3.2525 -0.695422 0.186007
C  2.600672 1.070102 -0.076671
C  1.713962 -1.207733 0.056651
C  3.912651 0.557679 -0.139484
C  3.028364 -1.720254 -0.002697
C  4.130597 -0.840127 -0.106028
H  -2.401454 1.168721 0.859806
H  -0.861518 -1.002074 -0.334773
H  -2.082765 2.1799 -1.371988
H  -3.799839 1.706912 -1.135995
H  -2.727384 0.710695 -2.181993
H  2.404084 2.147138 -0.087799
H  0.882083 -1.913884 0.167003
H  4.763651 1.243648 -0.21222
H  3.192492 -2.802543 0.039042
H  5.149555 -1.240209 -0.152761
H  -5.12754 -1.104409 0.609003
