program: Orca
programVersion: 5.0.2
elementType: Cl O O N N N C C C C C C C C C C C C C C H H H H H H H H H H H H H H H H H H H
charge: 1
multiplicity: 1
keywords: wb97x-d3
keywords: def2-TZVPP
keywords: def2/J RIJCOSX
keywords: DEFGRID2
keywords: scfconv7
keywords: smallprint printgap noloewdin
keywords: NOSOSCF
formula: C14H19ClN3O2
InChI: InChI=1/C14H19ClN3O2/c1-14(2,3)12(19)13(18-9-16-8-17-18)20-11-6-4-10(15)5-7-11/h4-9,12-13,16,19H,1-3H3
39 atoms
Cl -5.515799 0.460118 0.356957
O  2.794091 -0.475492 -1.617644
O  0.046311 -0.902393 -0.90474
N  1.134423 0.942741 -0.019221
N  1.023052 1.627306 1.131756
N  1.181687 2.979793 -0.560547
C  3.446915 -1.365739 0.588493
C  2.356451 -1.19624 -0.493358
C  1.060409 -0.526895 -0.022947
C  3.879997 -0.0436 1.21995
C  2.935581 -2.314225 1.674729
C  4.661548 -2.016606 -0.080956
C  1.218906 1.752079 -1.054749
C  -1.243421 -0.576324 -0.560085
C  1.062792 2.871581 0.786515
C  -2.010016 0.088009 -1.505458
C  -1.790084 -0.927992 0.666662
C  -3.332313 0.400945 -1.229657
C  -3.107843 -0.605475 0.949301
C  -3.869921 0.058188 0.000466
H  2.047906 -2.211215 -0.779234
H  0.841425 -0.792041 1.012093
H  3.113889 0.378417 1.871551
H  4.764091 -0.202371 1.840823
H  4.145992 0.705278 0.471178
H  3.723171 -2.511184 2.404171
H  2.629114 -3.276302 1.257278
H  2.088356 -1.907205 2.230256
H  5.407418 -2.274812 0.672453
H  5.150091 -1.352467 -0.795941
H  4.394299 -2.939665 -0.602113
H  3.293535 -1.060765 -2.195956
H  1.28274 1.485777 -2.095772
H  1.005102 3.712615 1.456885
H  -1.582275 0.351829 -2.464359
H  -1.213037 -1.466134 1.407825
H  -3.929579 0.914896 -1.970553
H  -3.533196 -0.881306 1.904682
H  1.220847 3.837297 -1.101406
elementType: Cl O N C H
totalener: -1319.77601807 hartree
nucrepener: 1757.81637805 hartree
electener: -3077.59239612 hartree
oneelecener: -5275.75741297 hartree
twoeener: 2198.16501685 hartree
cpcmener: -0.10239324 hartree
kineticenergy: 1315.26665406 hartree
xcener: -104.286770919609 hartree
chargesum: 1.0000000
charge: -0.090116 -0.404056 -0.323520 0.137488 -0.289792 -0.088092 0.242255 0.107065 0.094169 -0.378949 -0.355525 -0.346351 0.190439 0.222366 0.164971 -0.216247 -0.175024 -0.111059 -0.129645 0.068549 0.112811 0.174914 0.098806 0.107611 0.101615 0.102236 0.104893 0.096827 0.097717 0.096640 0.107466 0.227801 0.211837 0.202794 0.150390 0.148243 0.146550 0.147706 0.244220
qa: -0.0901 -0.4041 -0.3235 0.1375 -0.2898 -0.0881 0.2423 0.1071 0.0942 -0.3789 -0.3555 -0.3464 0.1904 0.2224 0.1650 -0.2162 -0.1750 -0.1111 -0.1296 0.0685 0.1128 0.1749 0.0988 0.1076 0.1016 0.1022 0.1049 0.0968 0.0977 0.0966 0.1075 0.2278 0.2118 0.2028 0.1504 0.1482 0.1465 0.1477 0.2442
va: 1.2124 2.0165 2.0623 3.4000 2.8811 3.5729 3.6488 3.9624 3.8996 3.9373 3.9404 3.9163 3.9209 3.8104 3.9197 3.9933 3.9485 3.9569 3.9596 3.8604 1.0170 0.9777 1.0066 1.0073 1.0128 1.0027 1.0050 1.0044 1.0068 1.0114 1.0015 1.0100 0.9910 0.9756 1.0042 1.0020 1.0018 1.0028 0.9673
dispersion: -0.021043412 hartree
energy: -1319.797061483870 hartree
dipole: 40.43321 -37.04413 3.38907 -10.04271 13.09364 3.05093 3.96091 -5.18312 -1.22221
magnitude: 4.72100 au
magnitude: 11.99982 debye
